{"text_format":"1","workbook":"xlsx","n_sheets":12,"sheets":["Instructions","Minimum GPL for VOCs","Default GPL Metals","Alt-GPL Calc for VOCs","Alt-GPL Calc for Metals","Soil Phase Partitioning Calc","Lookup Table","IntercalsJury1","OutputJury1","GPL","IntercalcsJury2","OutputJury 2"],"not_rendered":{"charts":10,"images":2,"macros":1,"external_links":0,"defined_names":12,"comments":0,"pivot_tables":0},"unopened":[],"bounds":{"document_bytes":16777216,"sheet_cells":100000,"rows_first":2000,"rows_last":500,"rows_between":2000,"halvings":0,"cell_chars":16384,"cell_head_chars":4096},"cells_cut":0,"cells_raw":0,"read":"whole","date_system":"1900"}

{"sheet":"Instructions","index":0,"n_rows":95,"n_cols":2,"rows_kept":95,"cut":false,"hidden":false,"merged":[[174,7,184,7],[174,8,184,8],[174,9,184,9],[174,2,184,2],[174,3,184,3],[174,4,184,4],[174,5,184,5],[174,6,184,6],[174,14,184,14],[174,10,184,10],[174,11,184,11],[174,12,184,12],[174,13,184,13]]}
["2020-11-18"]
[null,"I.  Introduction"]
[]
[null,"The following presents brief instructions for understanding and operating the various worksheets. The primary goal is to accurately reproduce the GPL model in a spreadsheet form. However, an additional tool is included to calculate soil equilibrium concentrations. The document A Screening Method to Determine Soil Concentrations Protective of Groundwater Quality, September 1996 should be consulted for additional information."]
[]
[null,"Minimum GPL for VOCs:  This table shows the minimum GPLs using the revised 2007 chemical properties."]
[]
[null,"Default GPL Metals:  This table shows default metals GPLs per ADEQ’s Guidance: A Screening Method to Determine Soil Concentrations Protective of Groundwater Quality, September 1996 (Table 4, page 35). "]
[]
[null,"Alt-GPL Calc for VOCs:  The input and output worksheet to calculate alternative GPLs for VOCs. Drop down boxes are provided to enter chemical (cell K6) and soil (cell K15) type. The selection made from these drop down boxes affects certain chemical and soil parameters (cells K7-10, K16-18). Selecting a listed chemical and/or soil will cause a GPL to be calculated using the parameters included on the Lookup Table worksheet. Selecting \"Enter Chemical Properties\" and/or \"New Soil Type\" will cause a GPL to be calculated using data entered by the user on the Alt-GPL Calc for VOCs worksheet. Upon selecting the button “Run GPL”, a dialog box will appear. The dialog box contains check box 1 to use minimum GPL default values (cells K19 through K31) and check boxes 2 and 3 to use default chemical half-life values (cells K11, K12). Selecting any of these check boxes will overwrite user-entered values."]
[]
[null,"Alt-GPL Calc for Metals:  The input and output worksheet to calculate alternative GPLs for metals. The concentration of a metal found in soil is entered into the cell below the respective metal’s name. An associated SPLP or TCLP concentration is entered into the cell immediately to the right of the cell where the user entered a metal concentration."]
[]
[null,"Soil Phase Partitioning Calc:  The input and output worksheet to calculate equilibrium soil gas, liquid, and total soil contaminant concentrations. Drop down boxes are provided to enter chemical (cell G14) and soil (cell G21) type. The selection made from these drop down boxes affects certain chemical and soil parameters (cells H17-19, H23-25). Selecting a listed chemical and/or soil will cause equilibrium concentrations to be calculated using the parameters included on the Lookup Table worksheet. Selecting \"Enter Chemical Properties\" and/or \"New Soil Type\" will cause equilibrium concentrations to be calculated using data entered by the user on the Soil Phase Partitioning Calc worksheet. Upon selecting the button “Calculate Soil Phase Concentrations”, a dialog box will appear. The dialog box requires the user to input a chemical concentration and select the phase which the concentration represents. Additionally the dialog box offers the option of using the GPL default value for the fraction of organic carbon (foc, cell H16) in the soil from which the concentration was determined."]
[]
[null,"Lookup Table:  Details the chemical and soil data used when a chemical or soil type is selected from a drop down box on the Soil Phase Partitioning Calc or Alt-GPL Calc for VOCs worksheets."]
[]
[]
[null,"II.  Calculating a GPL"]
[]
[null,"A note on Model Calculation Values (column I) and Enter User Data (column K):"]
[]
[null,"When using the Alt-GPL Calc for VOCs worksheet, data must be entered into the field titled Enter User Data (column K), but the worksheet will actually use the values in the field titled Model Calculation Values (column I) to complete the GPL calculation. The values in the Model Calculation Values field will generally reflect those in the Enter User Data field. The exception to this occurs in rows 7-10 and 16-18. The Model Calculation Values in these rows will be dependent on the selections made from the drop down lists in cells K6 and K15. The values for Model Calculation Values and Enter User Data in the aforementioned rows may not match, but the calculation will still be performed."]
[]
[null,"In addition, users should be aware that values entered into the Enter User Data Field may be overwritten depending on selections made in the dialog box that appears after pressing the “Run GPL” button, found below the model input descriptions."]
[]
[null,"1) Select Alt-GPL Calc for VOCs worksheet. It may be necessary to load the Analysis Tool Pack to use the worksheets in the GPL Model Excel file. This may be done by clicking File -> Options -> Add-Ins -> Analysis Toolpack -> Go..."]
[]
[null,"2) Select a chemical from the drop down list in cell K6. Values for Kh, S, Koc and WQS of the selected chemical will automatically be drawn from the Lookup Table worksheet and placed in the appropriate cells in the Model Calculation Values field (column I)."]
[]
[null,"To calculate a GPL for a chemical not available on the drop down list or to force the Model Calculation Values to mirror the Enter User Data values, select \"Enter chemical properties\" from the list. Values for Kh, S, Koc and WQS must be entered into cells K7-10, respectively, if “Enter chemical properties” is selected."]
[]
[null,"3) Enter an appropriate value for T1/2 V and T1/2 GW (biodegradation half-life in vadose zone and groundwater, respectively) in cells K11 and 12, respectively. The biodegradation half-life may be different in the vadose zone and groundwater but typically, they are the same. For petroleum hydrocarbons, the assumed half-life is 1,000 days. Chlorinated compounds are assumed to be relatively non-biodegradable and a half-life of 100,000 days is assumed."]
[]
[null,"Regardless of values entered into the Enter User Data field, options to use either assumed value will be presented as check box 2 and 3 in the dialog box that appears after pressing the “Run GPL” button. Selecting either check box will overwrite data in cells K11 and 12. Not selecting either check box will maintain the user-entered data in cells K11 and 12. See the publication A Screening Method to Determine Soil Concentrations Protective of Groundwater Quality Leaching Guidance, September 1996 for a discussion of biodegradation rates."]
[]
[null,"4) Select a soil type from the drop down list in cell K15. Values for Φ, Pb, and θ of the selected soil type will automatically be drawn from the Lookup Table worksheet and placed in the appropriate cells in the Model Calculation Values field (column I)."]
[]
[null,"Other soil properties may be appropriate based upon site-specific information. To calculate a GPL for a soil type not available on the drop down list or to force the Model Calculation Values to mirror the Enter User Data values, select \"New Soil Type\" from the list. Values for Φ, Pb, and θ must be entered into cells K16-18, respectively, if “New Soil Type” is selected."]
[]
[null,"Values for Φ, Pb, and θ used to calculate default GPLs can be automatically entered into the Model Calculation Values field by selecting \"GPL Defaults\" from the drop down list."]
[]
[null,"5) Enter the remaining model inputs (K19-31). Column H lists the default GPL values for variables considered by the GPL calculation. GPL default values can be quickly and automatically entered by selecting check box 1 in the dialog box that appears after pressing the “Run GPL” button. Check box 1 automatically makes the depth to groundwater, Z (cell K26), equal to the depth of incorporation, L (cell K25), resulting in a minimum GPL."]
[]
[null,"Other GPL values can be calculated by entering data into the Enter User Data field and not selecting check box 1 in the dialog box that appears after pressing the “Run GPL” button. See the publication A Screening Method to Determine Soil Concentrations Protective of Groundwater Quality Leaching Guidance, September 1996 for a discussion of default values."]
[]
[null,"6) Click the “Run GPL” Button. Upon clicking the button, a dialog box will appear. The dialog box contains three options that may be selected, check boxes 1, 2, and 3. Check boxes 2 and 3 may not be selected simultaneously and a message to this effect will appear if it is attempted."]
[]
[null,"Check box 1:  Overwrites Enter User Data cells K19-31 with values used in a minimum default GPL calculation."]
[]
[null,"Check box 2:  Overwrites Enter User Data cells K11 and 12 with values used in a default GPL calculation for relatively biodegradable compounds (generally, petroleum hydrocarbons)."]
[]
[null,"Check box 3:  Overwrites Enter User Data cells K11 and 12 with values used in a default GPL calculation for relatively non-biodegradable (generally, chlorinated compounds)."]
[]
[null,"After selecting appropriate check boxes, click the “OK” button."]
[]
[null,"7) View the results. Rows 48 through 52 of the Alt-GPL Valc for VOCs worksheet display the GPL and information about the calculation. If the GPL exceeds the solubility threshold, a warning note appears. Additionally, it is noted whether the GPL is calculated based upon a risk-based standard or an Aquifer Water Quality Standard.   "]
[]
[]
[null,"III.  Soil Phase Partitioning"]
[]
[null,"A note on Calculation values (column F) and Data Enter values (column H):"]
[]
[null,"When using the Soil Phase Partitioning Calc worksheet, user data is entered into the fields under Data Enter (column H), but the worksheet will actually use the values in the fields under Calculation (column F) to complete the phase partitioning calculation. The values in the Calculation values fields (cells F17-19 and F23-25) will generally be determined by the selections made in the drop down lists in cells G14 and 21, and NOT match their corresponding Data Enter fields (cells H17-19 and H23-25). The exception to this occurs when “Enter chemical properties” and/or “New Soil Type” are selected from the dropdown lists. Either of these selections will cause the values in the Calculation values fields to match the data entered into the corresponding Data Enter fields. The values for the Calculation fields and Data Enter fields in the aforementioned cells may not match, but the calculation will still be performed."]
[]
[null,"In addition, users should be aware that a value entered into cell H16 of the Data Enter field will be overwritten if the check box “Insert GPL default for foc (.001)” is selected in the dialog box that appears after pressing the “Calculate Soil Phase Concentrations” button."]
[]
[null,"1) Select Soil Phase Partitioning Calc worksheet. It may be necessary to load the Analysis Tool Pack to use the worksheets in the GPL Model Excel file. This may be done by clicking File -> Options -> Add-Ins -> Analysis Toolpack -> Go..."]
[]
[null,"2) Select a chemical from the drop down list in cell G14. Values for Koc, Kh, and S of the selected chemical will automatically be drawn from the Lookup Table worksheet and placed in the appropriate cells in the Calculation field (column F)."]
[]
[null,"4) Enter an appropriate value for foc in cell H16. The value of foc used for default GPL calculations is 0.001. Regardless of the foc value entered into Data Enter cell H16, an option to use the default GPL foc value will be presented in the dialog box that appears after pressing the “Calculate Soil Phase Concentrations” button. Selecting this check box will overwrite any user-entered value in cell H16 with 0.001 and the Calculation value in cell F16 will update to match."]
[]
[null,"5) Select a soil type from the drop down list in cell G21. Values for Pb, Ow, and Ot of the selected soil type will automatically be drawn from the Lookup Table worksheet and placed in the appropriate cells in the Calculation values field (column F)."]
[]
[null,"Other soil properties may be appropriate based upon site-specific information. To calculate phase concentrations for a soil type not available on the drop down list or to force the Calculation values to mirror the Data Enter values, select \"New Soil Type\" from the list. Values for Pb, Ow, and Ot must be entered into cells H23-25, respectively, if “New Soil Type” is selected."]
[]
[null,"6) Click the “Calculate Soil Phase Concentrations” button. Upon clicking the button, a dialog box will appear. The dialog box contains three options for a known concentration: soil gas, soil solid, and liquid phase. Select the phase of the known concentration and input the concentration (paying attention to the units) into the data entry field below the three options. The spreadsheet will calculate equilibrium concentrations for the two unselected, unknown phases."]
[]
[null,"Additionally, there is an option within the dialog box to “Insert GPL defaults for foc (.001)”. Selecting this option will cause a user-entered value in cell H16 of the Data Enter field to be overwritten with the GPL default value for foc of 0.001."]
[]
[null,"After selecting appropriate check boxes, click the “OK” button."]
[]
[null,"7) View the results. Equilibrium concentrations of soil gas, soil solid, and liquid will appear in rows 40, 43, and 46, respectively. A soil saturation concentration will also be calculated using the values in the Calculation field, and shown in row 49. If the saturation concentration exceeds the soil concentration, a warning note appears in row 50."]
[]
[null,"It is necessary to click on the “Calculate Soil Phase Concentrations” button anytime a spreadsheet value is changed in order to calculate a new equilibrium concentration distribution."]
[]
[]
[null,"IV.  Updates"]
[]
[null,"The first version of the spreadsheet GPL was updated on 1-2013 to correct a problem with the look up table and to password"]
[]
[null,"Updated 9-2020 in response to user feedback and to correct xylene saturation error."]
[]
[null,"Protect all of sheets."]

{"sheet":"Minimum GPL for VOCs","index":1,"n_rows":39,"n_cols":5,"rows_kept":39,"cut":false,"hidden":false,"merged":[]}
["2008-11-01"]
[]
[]
[null,"Saturation Concentrations and Minimum GPLs"]
[]
[]
[null,"Compound","Spreadsheet Min.","1996 Min. GPL","Saturation "]
[null,null,"GPL (mg/kg)","(mg/kg)","(mg/kg)"]
[null,null,"(2007 chemical properties)","(1996 chemical properties)","(2007 chemical properties)"]
[null,null,"( foc = .001, θw=.15, Φ=.25)","( foc = .001, θw=.15, n=.25)","( foc = .001, θw=.15, n=.25)"]
[null,"Benzene",0.7,0.71,313.38]
[null,"Carbon tetrachloride",0.95,1.6,282.29333333333335]
[null,"Chlorobenzene",16.5,22,154.69266666666667]
[null,"o-dichlorobenzene","116*",72,116.03413333333332]
[null,"p-dichlorobenzene",27,9.3000000000000007,53.773333333333326]
[null,"1,2-Dichloroethane (DCA)",0.23,0.21,1020.6233333333333]
[null,"1,1-Dichloroethylene(DCE)",0.85,0.81,529.53666666666675]
[null,"cis-1,2-Dichloroethylene",5.3,4.9000000000000004,513.2166666666667]
[null,"trans-1,2-Dichloroethylene",9.1999999999999993,8.4,1122.45]
[null,"1,2-Dichloropropane",0.36,0.28000000000000003,423.82666666666671]
[null,"Ethylbenzene","82*",120,82.370666666666665]
[null,"Styrene",45,36,273.89533333333333]
[null,"Tetrachloroethylene (PCE)",0.8,1.3,61.053333333333335]
[null,"Toluene","159*",400,159.07066666666668]
[null,"1,1,1-Trichloroethane",0.94,1,334.1]
[null,"Trichloroethylene (TCE)",0.76,0.61,323.54666666666674]
[null,"Xylenes (total)3","81*",2200,81]
[]
[null,"* = Based upon saturation limit"]
[null,"Saturation = S/Pb(Kd*Pb+θw+Kh*θa)"]
[null,"S = Solubility"]
[null,"Pb= Soil dry bulk density = 1.5"]
[null,"Kd = Distribution coefficient = foc*Koc"]
[null,"Koc = Organic carbon partition coefficient"]
[null,"foc = Fraction of organic carbon = 0.001"]
[null,"θa = Air filled porosity"]
[null,"Kh = Henry's constant"]
[null,"θw = Water content= 0.15"]
[null,"Φ = Total porosity = 0.25"]

{"sheet":"Default GPL Metals","index":2,"n_rows":14,"n_cols":2,"rows_kept":14,"cut":false,"hidden":false,"merged":[[0,0,0,1],[13,0,15,1]]}
["Default GPL - Metals\nmilligrams per kilogram (mg/Kg) "]
["Antimony",35]
["Arsenic",290]
["Barium",12000]
["Beryllium",23]
["Cadmium",29]
["Chromium, unspeciated",590]
["Lead",290]
["Mercury",12]
["Nickel",590]
["Selenium",290]
["Thallium",12]
[]
["For more information, refer to the ADEQ September 1996 Guidance: A Screening Method to Determine Soil Concentrations Protective of Groundwater Quality(Table 4, page 35)"]

{"sheet":"Alt-GPL Calc for VOCs","index":3,"n_rows":52,"n_cols":33,"rows_kept":52,"cut":false,"hidden":false,"merged":[[91,12,91,17],[106,47,106,52],[50,3,50,4],[1,8,1,10],[68,26,68,31],[49,3,49,4],[37,47,37,52],[38,6,40,11],[36,6,36,11],[37,6,37,11],[41,6,42,11],[44,25,44,26],[43,25,43,26],[34,28,34,29],[34,30,34,31],[30,27,30,31],[42,25,42,26],[41,25,41,31]]}
["2020-11-18"]
[]
[null,null,null,null,null,null,"*The Mixing Cell Diagram at the right of the Input Field visually depicts measurements."]
[null,null,null,null,null,null,"Input Field",null,null,null,null,null,null,null,"Mixing Cell Diagram -- conventional units (autofills)"]
[null,null,"Model Input Descriptions",null,null,null,"Parameter","Min GPL Default","Model Calculation Values","Modeled  Value : Custom /Default","Enter User Data","units"]
["Select chemical name from drop down list",null,null,null,null,null,"Compound",null,null,null,"Enter chemical properties",null,null,null,null,null,null,null,null,"Sc = distance from vadose impact to"]
["Kh = Henry's Constant (dimensionless)",null,null,null,null,null,"Kh","-",{"$f":"VLOOKUP(K$6,'Lookup Table'!A9:J79,3)","v":1},{"$f":"IF(K$6=\"Enter chemical properties\",\"C\",\"D\")","v":"C"},1,"ratio",null,null,null,null,null,null,null,"groundwater compliance point (m)",null,null,null,null,"w = release width (m)"]
["S = water solubility (mg/l)",null,null,null,null,null,"S","-",{"$f":"VLOOKUP($K$6,'Lookup Table'!A8:J79,4)","v":1},{"$f":"IF(K$6=\"Enter chemical properties\",\"C\",\"D\")","v":"C"},1,"mg/L",null,null,null,null,null,null,null,null,{"$f":"AC38","v":30.5},null,null,null,null,{"$f":"AC39","v":10}]
["Koc = soil distribution coefficient (L/Kg)",null,null,null,null,null,"Koc","-",{"$f":"VLOOKUP($K$6,'Lookup Table'!A8:J79,2)","v":1},"C",1,"L/kg"]
["WQS = Water Quality Standard (ug/l)- see help cells in Columns G & H",null,null,null,null,null,"WQS","-",{"$f":"IF(VLOOKUP(K$6,'Lookup Table'!A8:J79,5) =0,IF( VLOOKUP(K$6,'Lookup Table'!A8:J79,6) =0, 'Alt-GPL Calc for VOCs'!$K10, VLOOKUP(K$6,'Lookup Table'!A8:J79,6)), VLOOKUP(K$6,'Lookup Table'!A8:L79,5))","v":1},"C",1,"ug/L"]
["T1/2 V = vadose zone half life (d)",null,null,null,null,null,"T1/2 V","1,000/100,000",{"$f":"$K$11","v":100000},{"$f":"IF(OR(I11=1000,I11=100000),(\"D\"),(\"C\"))","v":"D"},100000,"day",null,null,null,null,null,null,null,null,null,null,null,null,null,null,null,null,{"$f":"AC36","v":1000},"L = depth of"]
["T1/2 GW = groundwater  half life (d)",null,null,null,null,null,"T1/2 GW","1,000/100,000",{"$f":"$K$12","v":100000},{"$f":"IF(OR(I12=1000,I12=100000),(\"D\"),(\"C\"))","v":"D"},100000,"day",null,null,"Z = groundwater ",null,{"$f":"AC37","v":1000},null,null,null,null,null,null,null,null,null,null,null,null,"incorporation (cm)"]
["Ct = initial total soil contaminant concentration (ug/kg, [ug/kg = (ug/l)/Pb])",null,null,null,null,null,"Ct (Co)","-",{"$f":"$K$13","v":100},"C",100,"ug/kg"]
[null,null,null,null,null,null,null,null,null,null,null,null,null,null,"or vadose zone depth"]
["Select Soil Type from drop down list",null,null,null,null,null,"Soil",null,null,null,"New Soil Type",null,null,null,"of interest (cm)",null,null,null,null,null,null,"▼",null,null,null,null,null,null," "]
["Φ = total porosity",null,null,null,null,null,"Φ",0.25,{"$f":"VLOOKUP($K$15,'Lookup Table'!B99:F109,3)","v":0.5},{"$f":"IF(K$15=\"New Soil Type\",\"C\",\"D\")","v":"C"},0.5,"ratio"]
["Pb = dry bulk density (g/cm3)",null,null,null,null,null,"Pb",1.5,{"$f":"VLOOKUP($K$15,'Lookup Table'!B99:F109,4)","v":1.5},{"$f":"IF(K$15=\"New Soil Type\",\"C\",\"D\")","v":"C"},1.5,"g/cm3",null,null,null,null,null,null,null,null,null,null,null,null,null,null,null,"d1"]
["θ = moisture content (vol/vol)",null,null,null,null,null,"θ",0.15,{"$f":"VLOOKUP($K$15,'Lookup Table'!B99:F109,5)","v":0.45},"C",0.45,"ratio",null,null,null,null,null,null,null,null,null,null,null,null,null,null,null,null,"d = mixing cell"]
["foc V = fraction of organic carbon in vadose zone",null,null,null,null,null,"foc V",1E-3,{"$f":"$K$19","v":1E-3},{"$f":"IF(I19=H19,(\"D\"),(\"C\"))","v":"D"},1E-3,"ratio",null,null,null,null,null,null,null,null,null,null,null,null,null,null,null,null,"depth (centimeters)"]
["foc A = fraction of organic carbon in aquifer",null,null,null,null,null,"foc A",1E-3,{"$f":"$K$20","v":1E-3},{"$f":"IF(I20=H20,(\"D\"),(\"C\"))","v":"D"},1E-3,"ratio"]
["Dga = gaseous diffusion coefficient (cm2/d)",null,null,null,null,null,"Dga",7000,{"$f":"$K$21","v":7000},"D",7000,"cm2/d"]
["D1w = liquid diffusion coefficient (cm2/d)",null,null,null,null,null,"D1w",0.7,{"$f":"$K$22","v":0.7},"D",0.7,"cm2/d",null,null,null,null,null,null,"dn"]
["d = diffusion layer thickness (cm)",null,null,null,null,null,"d",0.5,{"$f":"$K$23","v":0.5},"D",0.5,"cm"]
["Ai = infiltration rate inside source area, water flux (cm/d)",null,null,null,null,null,"Ai",7.0000000000000001E-3,{"$f":"$K$24","v":7.0000000000000001E-3},"D",7.0000000000000001E-3,"cm/d",null,null,null,null,null,"w"]
["L = depth of incorporation (cm)",null,null,null,null,null,"L",1000,{"$f":"K25","v":1000},"D",1000,"cm",null,null,"s = screen",null,{"$f":"AC40","v":8.1999999999999993},"e"]
["Z = depth to water or depth of interest, (cm)",null,null,null,null,null,"Z",1000,{"$f":"K26","v":1000},"D",1000,"cm",null,null,"interval (m)",null,null,"l"]
["Sc = distance from edge of release to compliance point (meters)",null,null,null,null,null,"Sc",30.5,{"$f":"$K$27","v":30.5},"D",30.5,"m",null,null,null,null,null,"l",null,null,null,null,null,null,null,null,null,"mixing cells"]
["w = release width (meters)",null,null,null,null,null,"w",10,{"$f":"$K$28","v":10},"D",10,"m",null,null,null,null,null,null,null,null,null,null,null,null,null,null,null,"(each 1 meter wide)"]
["s = well screen interval (meters)",null,null,null,null,null,"s",8.1999999999999993,{"$f":"$K$29","v":8.1999999999999993},"D",8.1999999999999993,"m"]
["v = groundwater velocity [v=Ki/n], actual velocity not Darcy velocity (cm/d) ",null,null,null,null,null,"v",10,{"$f":"K30","v":10},"D",10,"cm/d",null,null,null,null,null,"s"]
["Si = infiltration rate outside source area (cm/d)",null,null,null,null,null,"Si",7.0000000000000001E-3,{"$f":"$K$31","v":7.0000000000000001E-3},"D",7.0000000000000001E-3,"cm/d",null,null,null,null,null,"c",null,null,null,null,null,null,null,null,null,"Input Summary"]
["time step =  vary until output graphs shows complete curve, Jury 1 solution (days)",null,null,null,null,null,"time step","auto",{"$f":"$K$32","v":10},"C",10,"day",null,null,null,null,null,"r",null,null,null,null,null,null,null,null,null,null,"Input units",null,"English units"]
["d time = depth profile time, Jury 2 solution (d)",null,null,null,null,null,"d time","-",{"$f":"$K$33","v":365},"C",365,"day"]
["Vd = total vadose zone depth, Jury 2 solution (cm)",null,null,null,null,null,"Vd","-",{"$f":"$K$34","v":3000},"C",3000,"cm"]
[null,null,null,null,null,null,null,null,null,null,null,null,null,null,null,null,null,"r",null,null,null,null,null,null,null,null,null,"Variable","Input units",null,"English units"]
[null,null,null,null,null,null,"Data Entry Legend",null,null,null,null,null,null,null,null,null,null,"e",null,null,null,null,null,null,null,null,null,"L",{"$f":"'Alt-GPL Calc for VOCs'!$K$25","v":1000},"cm",{"$f":"AC36/2.54/12","v":32.808398950131235},"feet"]
[null,null,null,null,null,null,"Help Cells - Cells that may be selected to provide a pop-up window with info to help in data entry",null,null,null,null,null,null,null,null,null,null,"e",null,null,null,null,null,null,null,null,null,"Z",{"$f":"'Alt-GPL Calc for VOCs'!$K$26","v":1000},"cm",{"$f":"AC37/2.54/12","v":32.808398950131235},"feet"]
[null,null,null,null,null,null,"Select entry from the drop-down menu",null,null,null,null,null,null,null,null,null,null,"n",null,null,null,null,null,null,null,null,null,"Sc",{"$f":"'Alt-GPL Calc for VOCs'!$I$27","v":30.5},"m",{"$f":"AC38*100/2.54/12","v":100.06561679790026},"feet"]
[null,null,null,null,null,null,"A manually entered value will be used only if you selected \"enter chemical properties\" or \"new soil type\", otherwise this value will reflect the chemical or soil type you selected from the drop down menus cells K6 and K15)",null,null,null,null,null,null,null,null,null,null,null,null,null,null,null,null,null,null,null,null,"w",{"$f":"'Alt-GPL Calc for VOCs'!$I$28","v":10},"m",{"$f":"AC39*100/2.54/12","v":32.808398950131235},"feet"]
[null,null,null,null,null,null,null,null,null,null,null,null,null,null,null,null,null,null,null,null,null,null,null,null,null,null,null,"s",{"$f":"'Alt-GPL Calc for VOCs'!$I$29","v":8.1999999999999993},"m",{"$f":"AC40*100/2.54/12","v":26.902887139107605},"feet"]
[null,null,null,null,null,null,null,null,null,null,null,null,null,null,null,null,null,null,null,null,"well"]
[null,null,null,null,null,null,"These cells may use manual entry, but your entry may be overwritten depending on what boxes you select after pressing the \"Run GPL\" button. Specific details are included in the help cells.",null,null,null,null,null,null,null,null,null,null,null,null,null,null,null,null,null,null,"Mixing Cell Thickness:  Jw x Δt/Φ  (see GPL Guidance)"]
[null,null,null,null,null,null,null,null,null,null,null,null,null,null,null,null,null,null,null,null,null,null,null,null,null,"Variable",null,"Jw","Φ","Δt","cell","cm"]
[null,null,null,null,null,null,null,null,null,null,null,null,null,null,null,null,null,null,null,null,null,null,null,null,null,"First mixing cell",null,{"$f":"'Alt-GPL Calc for VOCs'!$I$24","v":7.0000000000000001E-3},{"$f":"'Alt-GPL Calc for VOCs'!$I$16","v":0.5},{"$f":"100/I30","v":10},"d1",{"$f":"AB44*AD44/AC44","v":0.14000000000000001}]
[null,null,null,null,null,null,null,null,null,null,null,null,null,null,null,null,null,null,null,null,null,null,null,null,null,"Last mixing cell",null,{"$f":"'Alt-GPL Calc for VOCs'!$I$31","v":7.0000000000000001E-3},{"$f":"'Alt-GPL Calc for VOCs'!$I$16","v":0.5},{"$f":"AD44","v":10},"dn",{"$f":"(AB44*AC39*AD44/AC44)+(AB45*AD45*AC38/AC45)","v":5.6700000000000008},"if > s, then s"]
[]
[null,null,null,"Chemical:"]
[null,null,null,{"$f":"VLOOKUP(K$6,'Lookup Table'!A9:J79,1)","v":"Enter chemical properties"}]
[]
[null,null,null,"GPL (mg/kg) =",null,{"$f":"GPL!E90","v":0.25486087065758301},{"$f":"IF(F50>F51,\"WARNING: GPL exceeds saturation, discuss with specific ADEQ Program\",\"\")","v":""}]
[null,null,null,"Saturation conc. (mg/kg) =",null,{"$f":"IntercalsJury1!M30","v":0.33433333333333337}]
[null,null,null,{"$f":"IF(VLOOKUP(K$6,'Lookup Table'!A8:J79,5) = 0, \"GPL based upon risk based water quality standard\", \"GPL based upon Aquifer Water Quality Standard\")","v":"GPL based upon risk based water quality standard"}]

{"sheet":"Alt-GPL Calc for Metals","index":4,"n_rows":30,"n_cols":15,"rows_kept":30,"cut":false,"hidden":false,"merged":[[0,0,0,14],[3,1,3,2],[3,3,3,4],[3,5,3,6],[3,7,3,8],[3,9,3,10],[3,11,3,12],[3,13,3,14],[4,13,4,14],[5,1,5,2],[5,3,5,4],[5,5,5,6],[5,7,5,8],[5,9,5,10],[5,11,5,12],[5,13,5,14],[4,1,4,2],[4,3,4,4],[4,5,4,6],[4,7,4,8],[4,9,4,10],[4,11,4,12],[6,9,6,10],[9,1,9,2],[9,3,9,4],[9,5,9,6],[9,7,9,8],[9,9,9,10],[9,11,9,12],[9,13,9,14],[10,1,10,2],[10,3,10,4],[10,5,10,6],[10,7,10,8],[10,9,10,10],[10,11,10,12],[10,13,10,14],[11,13,11,14],[29,1,30,9],[11,1,11,2],[11,3,11,4],[11,5,11,6],[11,7,11,8],[11,9,11,10],[11,11,11,12],[18,2,20,12]]}
["Alternative GPL Calculator - Metals"]
[null,"Antimony (mg/Kg)","SPLP or TCLP (mg/L)","Arsenic (mg/Kg)","SPLP or TCLP (mg/L)","Barium (mg/Kg)","SPLP or TCLP (mg/L)","Beryllium (mg/Kg)","SPLP or TCLP (mg/L)","Cadmium (mg/Kg)","SPLP or TCLP (mg/L)","Chromium (mg/Kg)","SPLP or TCLP (mg/L)","Copper (mg/Kg)","SPLP or TCLP (mg/L)"]
[]
["R = Csoil / Cleachate",{"$f":"B3/C3","v":{"$error":"#DIV/0!"}},null,{"$f":"D3/E3","v":{"$error":"#DIV/0!"}},null,{"$f":"F3/G3","v":{"$error":"#DIV/0!"}},null,{"$f":"H3/I3","v":{"$error":"#DIV/0!"}},null,{"$f":"J3/K3","v":{"$error":"#DIV/0!"}},null,{"$f":"L3/M3","v":{"$error":"#DIV/0!"}},null,{"$f":"N3/O3","v":{"$error":"#DIV/0!"}}]
["CW",6.0000000000000001E-3,null,0.05,null,2,null,4.0000000000000001E-3,null,5.0000000000000001E-3,null,0.1,null,1.3]
["Alternative GPL = (292.9)*R*Cw",{"$f":"292.9*B4*B5","v":{"$error":"#DIV/0!"}},null,{"$f":"292.9*D4*D5","v":{"$error":"#DIV/0!"}},null,{"$f":"292.9*F4*F5","v":{"$error":"#DIV/0!"}},null,{"$f":"292.9*H4*H5","v":{"$error":"#DIV/0!"}},null,{"$f":"292.9*J4*J5","v":{"$error":"#DIV/0!"}},null,{"$f":"292.9*L4*L5","v":{"$error":"#DIV/0!"}},null,{"$f":"292.9*N4*N5","v":{"$error":"#DIV/0!"}}]
[]
[null,"Lead (mg/Kg)","SPLP or TCLP (mg/L)","Mercury (mg/Kg)","SPLP or TCLP (mg/L)","Nickel (mg/Kg)","SPLP or TCLP (mg/L)","Selenium (mg/Kg)","SPLP or TCLP (mg/L)","Thallium (mg/Kg)","SPLP or TCLP (mg/L)","Enter Chem (mg/Kg)","SPLP or TCLP (mg/L)","Enter Chem (mg/Kg)","SPLP or TCLP (mg/L)"]
[]
["R = Csoil / Cleachate",{"$f":"B9/C9","v":{"$error":"#DIV/0!"}},null,{"$f":"D9/E9","v":{"$error":"#DIV/0!"}},null,{"$f":"F9/G9","v":{"$error":"#DIV/0!"}},null,{"$f":"H9/I9","v":{"$error":"#DIV/0!"}},null,{"$f":"J9/K9","v":{"$error":"#DIV/0!"}},null,{"$f":"L9/M9","v":{"$error":"#DIV/0!"}},null,{"$f":"N9/O9","v":{"$error":"#DIV/0!"}}]
["CW",0.05,null,2E-3,null,0.1,null,0.05,null,2E-3,null," "]
["Alternative GPL = (292.9)*R*Cw",{"$f":"292.9*B10*B11","v":{"$error":"#DIV/0!"}},null,{"$f":"292.9*D10*D11","v":{"$error":"#DIV/0!"}},null,{"$f":"292.9*F10*F11","v":{"$error":"#DIV/0!"}},null,{"$f":"292.9*H10*H11","v":{"$error":"#DIV/0!"}},null,{"$f":"292.9*J10*J11","v":{"$error":"#DIV/0!"}},null,{"$f":"292.9*L10*L11","v":{"$error":"#DIV/0!"}},null,{"$f":"292.9*N10*N11","v":{"$error":"#DIV/0!"}}]
[]
["Formula:","Xs = (292.9)*(Csoil / Cleachate)*Cw"]
[null,"Xs","= The Alternative GPL; The maximum allowable total metals concentration in soil which achieves protection of groundwater quality."]
[null,292.89999999999998,"= This constant results from calculations involving the mixing cell dimensions, groundwater flow rate, and infiltration rate for the base case conditions."]
[null,"Csoil","= Total metals concentration in a soil (mg/Kg)."]
[null,"Cleachate","= The TCLP or SPLP metal concentration (mg/L)."]
[null,"R","= The ratio between the total metals content in a soil (Csoil) and the TCLP or SPLP leachate result (Cleachate). Default  GPLs for metals assumes the worst-case leachable fraction from a TCLP or SPLP of 20:1. The ratio may be greater and calculating a site specific \"R\" value based on the ratio between the total metals content in  soil and the TCLP or SPLP leachate result allows for the calculation of an alternative GPL for metals."]
[]
[]
[null,"Cw","= The maximum groundwater concentration in the mixing cell across the perforated interval of the monitor well and is equivalent to the AWQS."]
[]
["Notes: ","All soil data in milligrams per kilogram (mg/Kg) and aqueous data in milligrams per liter (mg/L)"]
[null,"All Cw inputs are the AWQS except for Copper: MCL for Copper = 1.3 mg/L"]
[null,"SPLP:  Synthetic Precipitation Leaching Procedure"]
[null,"TCLP:  Toxicity Characteristic Leaching Procedure "]
[null,"The last two boxes are available to enter information about any metal for which an Alt-GPL value is sought."]
[null,"It is best practice to co-locate or split sample for the total metals and SPLP/TCLP metals sample."]
[null,"For more information, refer to the ADEQ September 1996 Guidance: A Screening Method to Determine Soil Concentrations Protective of Groundwater Quality(Section IV, pages 33-35 and Appendix C)."]

{"sheet":"Soil Phase Partitioning Calc","index":5,"n_rows":49,"n_cols":8,"rows_kept":49,"cut":false,"hidden":false,"merged":[[37,0,37,7]]}
["2008-06-03"]
[]
["Calculate equilibrium soil phase concentrations "]
[]
["Cg (ug/l) =Ct(( Hd*Pb/((foc)(Koc)(Pb)+Ow +Hd (Ot-Ow)))"]
[]
["R (unitless) =  Hd*Pb/((foc)(Koc)(Pb)+Ow +Hd (Ot-Ow))"]
[]
["Ct ( ug/kg)= Cg/ R"]
[]
["Cl (ug/l) =  Cg/H"]
[]
[]
["Select chemical from drop down list, G14",null,null,null,null,null,"Toluene"]
[null,null,null,null,null,"Calculation ",null,"Data Enter"]
["foc = fraction of organic carbon =",null,null,null,null,{"$f":"$H16","v":1E-3},null,1E-3]
["Koc = soil distribution coefficient (ml/g) = ",null,null,null,null,{"$f":"IF($G$14=\"Enter chemical properties\",$H17,VLOOKUP($G$14,'Lookup Table'!A8:J79,2))","v":182},null,1]
["Kh = Henry's Constant  =",null,null,null,null,{"$f":"IF($G$14=\"Enter chemical properties\",$H18,VLOOKUP($G$14,'Lookup Table'!A8:J79,3))","v":0.27200000000000002},null,1]
["S = solubility in water (mg/l) =",null,null,null,null,{"$f":"IF($G$14=\"Enter chemical properties\",$H19,VLOOKUP($G$14,'Lookup Table'!A8:J79,4))","v":530},null,1]
[]
["Select soil from drop down list, G21",null,null,null,null,null,"Silty Clay"]
[]
["Pb = dry bulk density  (g/cm3)",null,null,null,null,{"$f":"IF($G$21=\"New Soil Type\",$H$23,VLOOKUP($G$21,'Lookup Table'!B99:F109,4))","v":1.38},null,1]
["Ow = water filled  porosity, (vol water/volume of soil)",null,null,null,null,{"$f":"IF($G$21=\"New Soil Type\",$H$24,VLOOKUP($G$21,'Lookup Table'!B99:F109,5))","v":0.216},null,1]
["Ot = porosity (vol voids/vol total)",null,null,null,null,{"$f":"IF($G$21=\"New Soil Type\",$H$25,VLOOKUP($G$21,'Lookup Table'!B99:F109,3))","v":0.48099999999999998},null,1]
[]
["Ot-Ow =",null,null,null,null,{"$f":"$F$25-$F$24","v":0.26500000000000001},"unitless"]
["Hd*Pb =",null,null,null,null,{"$f":"$F$18*$F$23","v":0.37535999999999997},"g/cm3"]
["Foc*Koc*Pb =",null,null,null,null,{"$f":"$F$16*$F$17*$F$23","v":0.25115999999999999},"g/cm3"]
["R =  Hd*Pb/((foc)(Koc)(Pb)+Ow +Hd (Ot-Ow))",null,null,null,null,{"$f":"$F$28/($F$29+$F$24+$F$18*$F$27)","v":0.69609079445145006},"unitless"]
[]
[]
[]
[]
[]
[]
[]
["-----OUTPUTS BELOW ARE FOR A SYSTEM IN EQUILIBRIUM-----"]
[]
["Cg (soil gas concentration ug/l)",null,null,null,null,null,null,3000]
[]
[]
["Ct (total soil solids concentration mg/kg)",null,null,null,null,null,null,4.3097826086956532]
[{"$f":"IF($H$43>$H$49,\"(Concentration exceeds saturation)\",\"\")","v":""}]
[]
["Cl (liquid phase concentration ug/l)",null,null,null,null,null,null,11029.411764705881]
[]
[]
["Saturation concentration  (mg/kg) = ",null,null,null,null,null,null,{"$f":"$F$19/$F$23*($F$29+$F$24+$F$18*$F$27)","v":207.09942028985512}]

{"sheet":"Lookup Table","index":6,"n_rows":109,"n_cols":10,"rows_kept":109,"cut":false,"hidden":false,"merged":[[86,0,87,9],[6,6,6,8],[80,0,81,9]]}
[]
[]
[]
[null,null,null,"Chemical Properties"]
[]
[]
["CONTAMINANT","Koc","Kh","S","Water Quality ","Risk-based","Residential SRL (mg/kg)",null,null,"Non-Residential"]
[null,"(L/Kg)","(dimensionless)","(mg/L)","Standard (ug/L)","Standard (ug/l)","10-6 ELCR","10-5 ELCR","Non-carc"," SRL (mg/kg)"]
["1,1,1-Trichloroethane*",110,0.70499999999999996,1300,7,null,null,null,1200,1200]
["1,1,2,2-Tetrachloroethane",93.3,1.41E-2,3000,null,0.2,0.42,4.2,null,9.3000000000000007]
["1,1,2-Trichlorethane",50.1,3.7400000000000003E-2,4400,5,null,0.74,7.4,null,16]
["1,1-Dichloroethane",31.6,0.23,5100,null,700,null,null,510,1700]
["1,1-Dichloroethylene(DCE)",58.9,1.07,2300,7,null,null,null,120,410]
["1,2,4-Trimethylbenzene",3720,0.23370000000000002,57,null,12,null,null,52,170]
["1,2-Dibromoethane ",28.1,2.9000000000000001E-2,3400,0.05,null,2.9000000000000001E-2,0.28999999999999998,null,0.63]
["1,2-Dichlorobenzene (ortho)",620,7.8200000000000006E-2,160,600,null,null,null,600,600]
["1,2-Dichloroethane (DCA)",17.399999999999999,4.0099999999999997E-2,8500,5,null,0.28000000000000003,2.8,null,6]
["1,2-Dichloropropane",43.7,0.115,2800,5,null,0.34,3.4,null,7.4]
["1,3,5-Trimethylbenzene",819,0.32,48,null,12,null,null,21,70]
["1,3-Butadiene",120,7.298,735,null,0.1,5.8000000000000003E-2,0.57999999999999996,null,1.2]
["1,3-Dichloropropene",45.7,0.72599999999999998,2800,null,0.4,0.79,7.9,null,18]
["1,4-Dichlorobenzene (para)",620,0.1,74,75,null,3.5,35,null,79]
["1,4-Dioxane",1,1.9599999999999999E-4,1000000,null,1,50,500,null,1600]
["2,4-Dinitrotoluene",363.8,2.21E-6,270,null,12,null,null,120,1200]
["2,6-Dinitrotoluene",371.4,3.0499999999999999E-5,352,null,6,null,null,61,620]
["Acenaphthene",4898,6.3550000000000004E-3,4.24,null,370,null,null,3700,29000]
["Anthracene",23500,2.6649999999999998E-3,4.3400000000000001E-2,null,1800,null,null,22000,240000]
["Benzene",58.9,0.22800000000000001,1800,5,null,0.65,"NA",null,1.4]
["Bis(2-ethylhexyl)phthalate (DEHP)",165000,1.1E-5,0.27,null,0.8,39,390,null,1200]
["Bromodichloromethane",55,6.5600000000000006E-2,6700,80,null,0.83,8.3000000000000007,null,18]
["Bromoform",87.1,2.1899999999999999E-2,3100,80,null,69,690,null,2200]
["Carbon disulfide",45.7,1.24,1200,null,700,null,null,360,720]
["Carbon tetrachloride",174,1.25,790,5,null,0.25,2.5,2.2000000000000002,5.5]
["Chlorobenzene",219,0.152,470,100,null,null,null,150,530]
["Chloroform",39.799999999999997,0.15,7900,80,null,0.94,9.4,null,20]
["Chrysene",398000,3.8785999999999998E-3,1.6000000000000001E-3,null,1.5,68,680,null,2000]
["cis-1,2-Dichloroethylene",35.5,0.16700000000000001,3500,70,null,null,null,43,150]
["Cumene (isopropylbenzene)",220,0.47149999999999997,61,null,660,null,null,92,92]
["Cyclohexane",160,8.1999999999999993,55,null,10300,null,null,140,140]
["Dibenzofuran",7760,5.3299999999999995E-4,3.1,null,12,null,null,140,140]
["Dibromochloromethane",468,3.4849999999999999E-2,4400,null,0.13,1.1000000000000001,11,null,26]
["Dichlorodifluoromethane",58,4.0999999999999996,280,null,390,null,null,94,310]
["Dicyclopentadiene",570,0.43869999999999998,1800,null,0.4,null,null,0.54,1.8]
["Enter chemical properties",{"$f":"'Alt-GPL Calc for VOCs'!$K$9","v":1},{"$f":"'Alt-GPL Calc for VOCs'!K7","v":1},{"$f":"'Alt-GPL Calc for VOCs'!K8","v":1}]
["Ethylbenzene",363,0.32300000000000001,170,700,null,null,null,400,400]
["Ethylene oxide",2.2000000000000002,3.0995999999999997E-3,1000000,null,2.4E-2,0.14000000000000001,1.4,null,3.4]
["Fluorene",13800,3.1570000000000001E-3,1.9,null,240,null,null,2700,26000]
["HCH (gamma) Lindane",3380,2.1000000000000001E-4,8,0.2,null,0.5,5,null,17]
["HCH-technical",3380,1.7499999999999998E-5,8,null,6.1999999999999998E-3,0.36,3.6,null,13]
["Heptachlor",52400,1.2E-2,0.18,0.4,null,0.12,1.2,null,3.8]
["Heptachlor epoxide",5260,8.5899999999999995E-4,0.2,0.2,null,0.06,0.6,null,1.9]
["Hexachlorobenzene",3380,6.9500000000000006E-2,6.1999999999999998E-3,1,null,0.34,3.4,null,11]
["Hexachlorobutadiene",993.5,0.42099999999999999,3.2,null,0.14000000000000001,7,70,18,180]
["Hexachlorocyclopentadiene",1667,1.1000000000000001,1.8,50,null,null,null,370,3700]
["Hexachloroethane",224.7,0.159,50,null,0.8,39,390,61,620]
["Methyl bromide",10.5,0.25600000000000001,12000,null,8.6999999999999993,null,null,3.9,13]
["Methyl ethyl ketone",4.5,1.1233999999999999E-3,268000,null,4200,null,null,23000,34000]
["Methyl isobutyl ketone",134,5.7399999999999994E-3,19000,null,560,null,null,5300,17000]
["Methyl tert-butyl ether (MTBE)",6,2.4066999999999998E-2,150000,null,11,32,320,null,710]
["Methylcyclohexane",2188,17.63,14,null,5200,null,null,230,230]
["Methylene bromide",25,3.6900000000000002E-2,11700,null,61,null,null,67,230]
["Methylene chloride",11.7,8.9800000000000005E-2,13200,null,4.3,9.3000000000000007,93,null,210]
["Naphthalene",1191,1.9802999999999998E-2,31,null,6.2,null,null,56,190]
["n-Butylbenzene",2830,0.53710000000000002,13.8,null,240,null,null,240,240]
["n-Hexane",890,5.0019999999999998,18,null,1500,null,null,110,110]
["Nitrobenzene",64.599999999999994,9.7990000000000013E-4,2100,null,3.4,null,null,20,100]
["n-Propylbenzene",2830,0.53710000000000002,13.8,null,240,null,null,240,240]
["Pyrene",105000,4.5100000000000001E-4,0.13500000000000001,null,180,null,null,2300,29000]
["sec-Butylbenzene",2150,0.76670000000000005,17,null,240,null,null,220,220]
["Styrene",776,0.113,310,100,null,null,null,1500,1500]
["tert-Butylbenzene",2150,0.51659999999999995,30,null,240,null,null,220,220]
["Tetrachloroethylene (PCE)",155,0.754,200,5,null,0.51,5.0999999999999996,null,13]
["Tetrahydrofuran",0.95,2.8699999999999997E-3,1000000,null,1.6,9.5,95,null,210]
["Toluene",182,0.27200000000000002,530,1000,null,null,null,650,650]
["trans-1,2-Dichloroethylene",52.5,0.38500000000000001,6300,100,null,null,null,69,230]
["Trichloroethylene (TCE)",166,0.42199999999999999,1100,5,null,3,30,17,65]
["Vinyl acetate",5.25,2.1000000000000001E-2,20000,null,410,null,null,430,1400]
["Vinyl chloride",18.600000000000001,1.107,2760,2,null,8.5000000000000006E-2,"NA",null,0.75]
["Xylenes (total)1",386,0.27600000000000002,160,10000,null,null,null,270,420]
["Those chemical values shown in red are taken from http://www.epa.gov/opptintr/exposure/pubs/episuite.htm"]
["Note: Reference for Koc and Ho values: U.S. EPA Soil Screening Guidance: User’s Guide, 2nd Edition  (July 1996)\n* GPL calculated on 1,1DCE water quality standard because of subsurface biotransformation"]
[]
["Koc = organic carbon partition coefficient"]
["Kh = Dimensionless Henry's Law Constant [HLC(atm-m)*41(25oC)]"]
["S = Solubility in water"]
["Xylenes (total)1 - Koc and Foc values for total xylenes represent average of values for ortho-, meta, and para-xylenes."]
["The following soil default values were used in the minimum GPL and soil saturation calculations: Foc = 0.001; θw = 0.15; θt = 0.25;                ρb = 1.5 g/cm3"]
[]
["foc",null,1E-3]
["Pb",null,1.5]
["θa (air filled content)",null,0.1]
["θw (water filled content vol/vol)",null,0.15]
[]
["Sat = S/Pb(KdPb+θw+Hθa)"]
[]
[null,null,null,"Soil Properties"]
[]
[null,"SCS Soil Type","SCS Soil Name","n (cm3/cm3)","Bulk density(g/cm3)","qw (cm3/cm3)"]
[null,"Clay","C",0.45900000000000002,1.43,0.215]
[null,"GPL Defaults","GPL Defaults",0.25,1.5,0.15]
[null,"New Soil Type",null,{"$f":"'Alt-GPL Calc for VOCs'!K16","v":0.5},{"$f":"'Alt-GPL Calc for VOCs'!K17","v":1.5},{"$f":"'Alt-GPL Calc for VOCs'!K18","v":0.45}]
[null,"Poorly graded gravels","GP",0.25,1.76,0.02]
[null,"Poorly graded sands","SP",0.25,1.66,0.05]
[null,"Sand","S",0.375,1.66,5.3999999999999999E-2]
[null,"Sandy Clay","SC",0.38500000000000001,1.63,0.19700000000000001]
[null,"Silt","SI",0.48899999999999999,1.35,0.16700000000000001]
[null,"Silty Clay","SIC",0.48099999999999998,1.38,0.216]
[null,"Well graded gravels","GW",0.35,1.76,0.02]
[null,"Well graded sands","SW",0.35,1.66,0.03]

{"sheet":"IntercalsJury1","index":7,"n_rows":317,"n_cols":40,"rows_kept":317,"cut":false,"hidden":true,"merged":[]}
["2008-05-10",null,"Solution of Jury 1 Equation"]
[]
[]
[null,"Ct = total soil contamination, ug/kg",null,null,null,null,null,null,null,null,null,null,{"$f":"'Alt-GPL Calc for VOCs'!I13","v":100}]
[null,"Co (ug/l)",null,null,null,null,null,null,null,null,null,null,{"$f":"$M$4*$M$10","v":150}]
[null,"T1/2 (d)",null,null,null,null,null,null,null,null,null,null,{"$f":"'Alt-GPL Calc for VOCs'!$I$11","v":100000}]
[null,"Kh (dimensionless)",null,null,null,null,null,null,null,null,null,null,{"$f":"'Alt-GPL Calc for VOCs'!I7","v":1}]
[null,"S (water solubility, mg/l)",null,null,null,null,null,null,null,null,null,null,{"$f":"'Alt-GPL Calc for VOCs'!I8","v":1}]
[null,"Φ(total porosity)",null,null,null,null,null,null,null,null,null,null,{"$f":"'Alt-GPL Calc for VOCs'!$I$16","v":0.5}]
[null,"Pb (g/cm3) (dry bulk density)",null,null,null,null,null,null,null,null,null,null,{"$f":"'Alt-GPL Calc for VOCs'!I17","v":1.5}]
[null,"foc",null,null,null,null,null,null,null,null,null,null,{"$f":"'Alt-GPL Calc for VOCs'!$I$19","v":1E-3}]
[null,"Dga (cm2/d)",null,null,null,null,null,null,null,null,null,null,{"$f":"'Alt-GPL Calc for VOCs'!$I$21","v":7000}]
[null,"D1w(cm2/d)",null,null,null,null,null,null,null,null,null,null,{"$f":"'Alt-GPL Calc for VOCs'!$I$22","v":0.7}]
[null,"L (cm)(depth of incorporation)",null,null,null,null,null,null,null,null,null,null,{"$f":"'Alt-GPL Calc for VOCs'!I25","v":1000}]
[null,"θ (vol/vol)= water content",null,null,null,null,null,null,null,null,null,null,{"$f":"'Alt-GPL Calc for VOCs'!I18","v":0.45}]
[null,"Jw (water flux- cm/d)",null,null,null,null,null,null,null,null,null,null,{"$f":"'Alt-GPL Calc for VOCs'!I24","v":7.0000000000000001E-3}]
[null,"Koc (cm3/g)",null,null,null,null,null,null,null,null,null,null,{"$f":"'Alt-GPL Calc for VOCs'!I9","v":1}]
[null,"z -cm(depth to water) or depth of interest",null,null,null,null,null,null,null,null,null,null,{"$f":"'Alt-GPL Calc for VOCs'!I26","v":1000}]
[null,"a(air filled porosity)",null,null,null,null,null,null,null,null,null,null,{"$f":"$M$9-$M$15","v":4.9999999999999989E-2}]
[null,"t (days) (calculation test)",null,null,null,null,null,null,null,null,null,null,{"$f":"'Alt-GPL Calc for VOCs'!I32","v":10}]
[null,"d(diffusion layer thickness,cm)",null,null,null,null,null,null,null,null,null,null,{"$f":"'Alt-GPL Calc for VOCs'!I23","v":0.5}]
[]
[]
[null,"Rl (liquid phase coeffcient ) = (Pb)(foc)(Koc)+Φ+aKh",null,null,null,null,null,null,null,null,null,null,{"$f":"$M$10*$M$17*$M$11+$M$15+$M$19*$M$7","v":0.50150000000000006},"=$M$10*$M$17*$M$11+$M$15+$M$19*$M$7"]
[null,"    Maximum liquid phase concentration (ug/l) = Co/Rl",null,null,null,null,null,null,null,null,null,null,{"$f":"$M$5/$M$24","v":299.10269192422726},"=$M$5/$M$24"]
[null,"Rg = Rl/Kh",null,null,null,null,null,null,null,null,null,null,{"$f":"$M$24/$M$7","v":0.50150000000000006},"=$M$24/$M$7"]
[null,"   Maximum gas phase concentration (ug/l)",null,null,null,null,null,null,null,null,null,null,{"$f":"($M$5/$M$26)","v":299.10269192422726},"=($M$5/$M$26)"]
[null,"Maximum sorbed soil concentration (ug/kg) = (Cl)(Foc)(Koc)",null,null,null,null,null,null,null,null,null,null,{"$f":"$M25*$M17*$M11","v":0.29910269192422728},"=$M25*$M17*$M11"]
[]
[null,"Soil saturation concentration (mg/kg)  =S/Pb(Foc*Koc*Pb+θ+Kh*a)",null,null,null,null,null,null,null,null,null,null,{"$f":"$M$8/$M$10*($M$11*$M$17*$M$10+$M$15+$M$19*$M$7)","v":0.33433333333333337},"=$M$8/$M$10*($M$11*$M$17*$M$10+$M$15+$M$19*$M$7)"]
[null,null,"A",null,null,null,null,null,null,null,null,null,null,null,"B"]
[null,null,null,null,null,null,null,"Ve=Jw/((Pb)(Foc)(Koc)+θ+aKh)"]
[null,null,null,null,null,null,null,null,null,null,null,null,null,null,null,null,"De=((a3.33)(Dga)(Kh)+(θ3.33)(D1w))/Φ2/((Pb)(Foc)(Koc)+θ+aKh)"]
[null,"(Pb)(Foc)(Koc)",null,null,null,null,null,null,{"$f":"$M$10*$M$11*$M$17","v":1.5E-3}]
[null,"(Pb)(Foc)(Koc)+θ+aKh",null,null,null,null,null,null,{"$f":"$I$34+$M$15+$M$19*$M$7","v":0.50150000000000006},null,null,null,null,null,"(a3.33)(Dga)(Kh)+(θ3.33)(D1w))/Φ2",null,null,null,{"$f":"((POWER($M$19,3.33)*$M$12*$M$7+POWER($M$15,3.33)*$M$13))/POWER($M$9,2)","v":1.49839626292817}]
[null,"Ve =",null,null,null,null,null,null,{"$f":"$M$16/$I$35","v":1.3958125623130606E-2},null,null,null,null,null,null,null,"De=",null,{"$f":"$S$35/$I$35","v":2.9878290387401192}]
[null,"R= (Pb)(Foc)(Koc)/n  +1",null,null,null,null,null,null,{"$f":"I34/M9 +1","v":1.0029999999999999}]
[]
[null,null,"C",null,null,null,null,null,null,null,null,null,null,null,"D"]
[null,"He=(Kh)(Dga)/(d((Pb)(Foc)(Koc)+θ+aKh))",null,null,null,null,null,null,null,null,null,null,null,"(1+Ve/He)(exp((Ve)(z)/De"]
[]
[null,null,{"$f":"$M$12*$M$7/($M$21*$I$35)","v":27916.251246261214},null,null,null,null,null,null,null,null,null,null,"1+(Ve/He) =",null,null,{"$f":"1+($I$36/$C$42)","v":1.0000005000000001}]
[null,null,null,null,null,null,null,null,null,null,null,null,null,"(Ve)(z)/De =",null,null,{"$f":"IF(($I$36*$M$18)/$S$36>225,225,($I$36*$M$18/$S$36))","v":4.6716614110613044}]
[null,null,null,null,null,null,null,null,null,null,null,null,null,"1+Ve/He)(exp((Ve)(z)/De =",null,null,{"$f":"Q42*EXP(Q43)","v":106.87521201929007}]
[null,null,null,null,null,null,null,null,null,null,null,null,null,"1+Ve/He)(exp((Ve)(z)/De ="]
[]
[null,null,"E",null,null,null,null,null,null,null,null,null,null,null,null,"F"]
[null,null,null,null,null,null,null,"erfc(z-L-(Ve)(t)/(4De)(t).5)",null,null,null,null,null,null,null,"z-(Ve)(t)/4De)(t).5)"]
[]
[null,"z-L-(Ve)(t)",null,null,null,null,null,null,{"$f":"($M$18-$M$14-($I$36*$M$20))","v":-0.13958125623130607},null,null,null,null,"z-(Ve)(t)",null,null,{"$f":"($M$18-$M$20*$I$36)","v":999.86041874376872}]
[null,"4De)(t).5)",null,null,null,null,null,null,{"$f":"POWER(4*$S$36*$M$20,0.5)","v":10.932207533229727},null,null,null,null,"z-(Ve)(t)/4De)(t).5 =",null,null,{"$f":"($M$18-($M$20*$I$36))/POWER(4*$S$36*$M$20,0.5)","v":91.460065655045028}]
[null,"z-L-(Ve)(t)/4De)(t).5)=",null,null,null,null,null,null,{"$f":"($M$18-$M$14-($I$36*$M$20))/POWER(4*$S$36*$M$20,0.5)","v":-1.276789301767575E-2},null,null,null,null,"erfc(z-(Ve)(t)/4De)(t).5))",null,null,{"$f":"IF($Q$51>0,ERFC(IF($Q$51<27,$Q$51,27)),1+ERF(IF(-$Q$51<27,-$Q$51,27)))","v":0}]
[null,"erfc(z-L-(Ve)(t)/(4De)(t).5)=",null,null,null,null,null,null,{"$f":"IF($I$52>0,ERFC(IF($I$52<27,$I$52,27)),1+ERF(IF(-$I$52<27,-$I$4,27)))","v":1},null,null,null,null,null,null,null,null,{"$f":"IF(($M$18-$M$20*$I$36)/POWER(4*$S$36*$M$20,0.5)>27,ERFC(27),6)","v":0}]
[]
[]
[null,null,"G",null,null,null,null,null,null,null,null,null,null,null,null,"H"]
[]
[null,null,null,null,null,null,null,"(1+Ve/He)(exp((Ve)(z)/De",null,null,null,null,null,null,null,"erfc(z+L+(Ve)(t)/(4De)(t).5))"]
[null,null,null,null,null,null,null,"(D)"]
[null,"1+(Ve/He) =",null,null,null,null,null,null,{"$f":"1+($I$36/$C$42)","v":1.0000005000000001},null,null,null,null,"z+L+(Ve)(t) =",null,null,{"$f":"$M$18+$M$14+($I$36*$M$20)","v":2000.1395812562314}]
[null,"(Ve)(z)/De =",null,null,null,null,null,null,{"$f":"($I$36*$M$18)/$S$36","v":4.6716614110613044},null,null,null,null,"z+L+(Ve)(t)/(4De)(t).5) =",null,null,{"$f":"($M$18+$M$14+$I$36*$M$20)/POWER(4*$S$36*$M$20,0.5)","v":182.95843498914309}]
[null,null,null,null,null,null,null,null,{"$f":"IF($I$61>225,225,$I$61)","v":4.6716614110613044},null,null,null,null,"erfc(z+L+(Ve)(t)/(4De)(t).5) =",null,null,{"$f":"IF($Q$61>27,ERFC(27),ERFC($Q$61))","v":0}]
[null,"1+Ve/He)(exp((Ve)(z)/De =",null,null,null,null,null,null,{"$f":"(1+($I$36/$C$42))*EXP($I$62)","v":106.87521201929007}]
[null,null,"I",null,null,null,null,null,null,null,null,null,null,null,null,"J"]
[]
[null,null,null,null,null,null,null,"erfc(z+(Ve)(t)/(4De)(t).5)",null,null,null,null,null,null,null,"2+(Ve)/(He)exp((He(He+Ve)(t)+(He+Ve)z)De"]
[]
[null,"z+(Ve)(t) =",null,null,null,null,null,null,{"$f":"$M$18+($I$36*$M$20)","v":1000.1395812562313},null,null,null,null,"2+(Ve)/(He)",null,null,{"$f":"2+$I$36/$C$42","v":2.0000005000000001}]
[null,"z+(Ve)(t)/((4)(De)(t))1/2 =",null,null,null,null,null,null,{"$f":"($M$18+($I$36*$M$20))/(POWER(4*$S$36*$M$20,0.5))","v":91.485601441080377}]
[null,"erfc(z+(Ve)(t)/(4De)(t).5) =",null,null,null,null,null,null,{"$f":"IF($I$69>27,ERFC(27),ERFC($I$69))","v":0},null,null,null,null,"He+Ve",null,null,{"$f":"$I$36+$C$42","v":27916.265204386837}]
[null,null,null,null,null,null,null,null,null,null,null,null,null,"He(He+Ve)(t)",null,null,{"$f":"$C$42*($C$42+$I$36)*$M$20","v":7793174733.0292263}]
[null,null,null,null,null,null,null,null,null,null,null,null,null,"(He+Ve)z",null,null,{"$f":"($C$42+$I$36)*$M$18","v":27916265.204386838}]
[null,null,null,null,null,null,null,null,null,null,null,null,null,"He(He+Ve)(t)+(He+Ve)z",null,null,{"$f":"$C$42*($C$42+$I$36)*$M$20+($C$42+$I$36)*$M$18","v":7821090998.233613}]
[null,null,null,null,null,null,null,null,null,null,null,null,null,"((He(He+Ve)(t)+(He+Ve)z)/De",null,null,{"$f":"($C$42*($C$42+$I$36)*$M$20+($C$42+$I$36)*$M$18)/$S$36","v":2617650105.4195323}]
[null,null,null,null,null,null,null,null,null,null,null,null,null,"IF(F101>225,225,F101,1)",null,null,{"$f":"IF(($C$42*($C$42+$I$36)*$M$20+($C$42+$I$36)*$M$18)/$S$36>225,225,($C$42*($C$42+$I$36)*$M$20+($C$42+$I$36)*$M$18)/$S$36)","v":225}]
[null,null,null,null,null,null,null,null,null,null,null,null,null,"exp((He(He+Ve)(t)+(He+Ve)z)De",null,null,{"$f":"EXP(IF(($C$42*($C$42+$I$36)*$M$20+($C$42+$I$36)*$M$18)/$S$36>225,225,($C$42*($C$42+$I$36)*$M$20+($C$42+$I$36)*$M$18)/$S$36))","v":5.2030551378848545E+97}]
[]
[null,null,"K",null,null,null,null,null,null,null,null,null,null,null,null,"L"]
[]
[null,null,null,null,null,null,null,"erfc(z+(2He+Ve)t)/(4Det)1/2",null,null,null,null,null,null,null,"exp(He*L/De) ="]
[null,null,null,null,null,null,null,null,null,null,null,null,null,null,null,"(X)"]
[null,"z+(2He+Ve)t/(4Det)1/2 =",null,null,null,null,null,null,{"$f":"$M$18+(2*$C$42+$I$36)*$M20/POWER(4*$S$36*$M$20,0.5)","v":52071.584838596027},null,null,null,null,"He*L/De",null,null,{"$f":"$C$42*$M$14/$S$36","v":9343322.8221226092}]
[null,"erfc(z+(2He+Ve)t/(4Det)1/2) =",null,null,null,null,null,null,{"$f":"IF($M$18+(2*$C$42+$I$36)*$M20/POWER(4*$S$36*$M$20,0.5)>27,ERFC(27),ERFC(($M$18+(2*$C$42+$I$36)*$M20/POWER(4*$S$36*$M$20,0.5))))","v":0},null,null,null,null,"IF(F118>225,225,F1181",null,null,{"$f":"IF($C$42*$M$14/$S$36>225,225,$C$42*$M$14/$S$36)","v":225}]
[null,null,null,null,null,null,null,null,null,null,null,null,null,"exp(He*L/De) =",null,null,{"$f":"EXP(Q83)","v":5.2030551378848545E+97}]
[]
[]
[null,null,"M",null,null,null,null,null,null,null,null,null,null,null,null,"N"]
[]
[null,null,null,null,null,null,null,"erfc(z+L+(2He+Ve)t)/(4Det)1/2",null,null,null,null,null,"u=.693/T1/2",null,null,{"$f":"0.693/$M$6","v":6.9299999999999997E-6}]
[null,null,null,null,null,null,null,null,null,null,null,null,null,"exp(-ut)",null,null,{"$f":"EXP(-0.693/$M$6*$M$20)","v":0.99993070240118953}]
[null,"z+L+(2He+Ve)t =",null,null,null,null,null,null,{"$f":"$M$18+$M$14+(2*$C$42+$I$36)*$M$20","v":560325.16450648056}]
[null,"(4Det)1/2=",null,null,null,null,null,null,{"$f":"POWER(4*$S$36*$M$20,0.5)","v":10.932207533229727}]
[null,"z+L+(2He+Ve)t/(4Det)1/2",null,null,null,null,null,null,{"$f":"($M$18+$M$14+(2*$C$42+$I$36)*$M$20)/POWER(4*$S$36*$M$20,0.5)","v":51254.53050569215}]
[null,"erfc(z+L+(2He+Ve)t)/(4Det)1/2",null,null,null,null,null,null,{"$f":"IF(($M$18+$M$14+(2*$C$42+$I$36)*$M$20)/POWER(4*$S$36*$M$20,0.5)>27,ERFC(27),ERFC(($M$18+$M$14+(2*$C$42+$I$36)*$M$20)/POWER(4*$S$36*$M$20,0.5)))","v":0}]
[]
[]
[]
[]
[]
[null,null,".5*Co(exp(-ut)(erfc(z-L-(Ve)(t)/(4De)(t).5 -erfc(z-(Ve)(t)/4De)(t).5)+(1+Ve/He)(exp((Ve)(z)/De)(erfc(z+L+(Ve)(t)/(4De)(t).5)-erfc(z+(Ve)(t)/(4De)(t).5)"]
[]
[]
[]
[]
[]
[null,null,null,null,null,null,null,null,null,null,null,null,null,null,null,null,null,null,{"$f":"POWER(4*$S$36*B129,0.5)","v":39.416634815073472}]
[]
[]
[]
[]
[]
[]
[]
[null,null,null,"exp(-ut)",null,"z-L-(Ve)(t)/(4De)(t).5",null,null,"erfc(z-L-(Ve)(t)/(4De)(t).5)",null,null,"z-(Ve)(t)/4De)(t).5)",null,"erfc(z-(Ve)(t)/4De)(t).5))",null,"erfc(z+L+(Ve)(t)/(4De)(t).5))",null,"    erfc(z+(Ve)(t)/(4De)(t).5)",null,null,"2+(Ve)/(He)exp((He(He+Ve)(t)+(He+Ve)z)De",null,null,null,"erfc(z+(2He+Ve)t)/(4Det)1/2",null,null,"erfc(z+L+(2He+Ve)t)/(4Det)1/2",null,null,null,"C/Co",null,"Ct (ug/kg)",null,"CL (ug/l)",null,"Cg (ug/l)",null,"Cs (ug/kg)"]
[null,null,null,"(N)",null,null,null,null,"(E)",null,null,null,null,"(F)",null,"(H)",null,"             (I)",null,null,"(j)",null,null,null,"(K)",null,null,"(M)",null,null,null,null,null,null,null,"(Cl=Ct/Rl)",null,"(Cg= Ct/Rg)"]
[null,{"$f":"'Alt-GPL Calc for VOCs'!$I$32","v":10}]
[null,{"$f":"B116","v":10},null,{"$f":"EXP(-0.693/$M$6*B117)","v":0.99993070240118953},null,{"$f":"($M$18-$M$14-($I$36*B117))/POWER(4*$S$36*B117,0.5)","v":-1.276789301767575E-2},null,null,{"$f":"IF(F117>0,ERFC(IF(F117<27,F117,27)),1+ERF(IF(-F117<27,-F117,27)))","v":1.0144062416537845},null,null,{"$f":"($M$18-(B117*$I$36))/POWER(4*$S$36*B117,0.5)","v":91.460065655045028},null,{"$f":"IF(L117>0,ERFC(IF(L117<27,L117,27)),1+ERF(IF(-L117<27,-L117,27)))","v":0},null,{"$f":"IF(($M$18+$M$14+$I$36*B117)/POWER(4*$S$36*B117,0.5)>27,ERFC(27),ERFC(($M$18+$M$14+$I$36*B117)/POWER(4*$S$36*B117,0.5)))","v":0},null,{"$f":"IF(($M$18+$I$36*B117)/(POWER(4*$S$36*B117,0.5))>27,ERFC(27),ERFC(($M$18+$I$36*B117)/(POWER(4*$S$36*B117,0.5))))","v":0},null,null,{"$f":"(2+$I$36/$C$42)*EXP(IF(($C$42*($C$42+$I$36)*B117+($C$42+$I$36)*$M$18)/$S$36>225,225,($C$42*($C$42+$I$36)*B117+($C$42+$I$36)*$M$18)/$S$36))","v":1.0406112877297279E+98},null,null,null,{"$f":"IF(($M$18+((2*$C$42+$I$36)*B117))/POWER(4*$S$36*B117,0.5)>27,ERFC(27),ERFC(($M$18+((2*$C$42+$I$36)*B117))/POWER(4*$S$36*B117,0.5)))","v":0},null,null,{"$f":"IF(($M$18+$M$14+((2*$C$42+$I$36)*B117))/POWER(4*$S$36*B117,0.5)>27,ERFC(27),ERFC(($M$18+$M$14+((2*$C$42+$I$36)*B117))/POWER(4*$S$36*B117,0.5)))","v":0},null,null,null,{"$f":"0.5*D117*((I117-N117)+($Q$44)*(P117-R117)+U117*(Y117-($Q$84*AB117)))","v":0.50716797286850979},null,{"$f":"$M$4*AF117","v":50.716797286850976},null,{"$f":"AF117*$M$25","v":151.69530594272473},null,{"$f":"AF117*$M$27","v":151.69530594272473},null,{"$f":"AF117*$M$28","v":0.15169530594272473}]
[null,{"$f":"B117+$M$20","v":20},null,{"$f":"EXP(-0.693/$M$6*B118)","v":0.99986140960453629},null,-1.805652746852579E-2,null,null,1.020372395341919,null,null,64.663004368714937,null,0,null,0,null,0,null,null,1.0406112877297279E+98,null,null,null,0,null,null,0,null,null,null,{"$f":"0.5*D118*((I118-N118)+($Q$44)*(P118-R118)+U118*(Y118-($Q$84*AB118)))","v":0.51011549076406415},null,{"$f":"$M$4*AF118","v":51.011549076406418},null,{"$f":"AF118*$M$25","v":152.57691647977987},null,{"$f":"AF118*$M$27","v":152.57691647977987},null,{"$f":"AF118*$M$28","v":0.15257691647977989}]
[null,30,null,0.99979212160970743,null,-2.211463941221831E-2,null,null,1.0249496310680841,null,null,52.789750433099613,null,0,null,0,null,0,null,null,1.0406112877297279E+98,null,null,null,0,null,null,0,null,null,null,0.51236828309432336,null,51.236828309432333,null,153.25073273010665,null,153.25073273010665,null,0.15325073273010667]
[null,40,null,0.99972283841637022,null,-2.5535786035351501E-2,null,null,1.0288077872158867,null,null,45.710880987995999,null,0,null,0,null,0,null,null,1.0406112877297279E+98,null,null,null,0,null,null,0,null,null,null,0.51426132061016561,null,51.42613206101656,null,153.81694534700861,null,153.81694534700861,null,0.15381694534700863]
[null,50,null,0.99965356002419203,null,-2.8549876716967904E-2,null,null,1.0322063354603144,null,null,40.879344904881336,null,0,null,0,null,0,null,null,1.0406112877297279E+98,null,null,null,0,null,null,0,null,null,null,0.5159243689612143,null,51.592436896121427,null,154.31436758560744,null,154.31436758560744,null,0.15431436758560746]
[null,60,null,0.99958428643284003,null,-3.1274822983749707E-2,null,null,1.0352783562434311,null,null,37.312353096898349,null,0,null,0,null,0,null,null,1.0406112877297279E+98,null,null,null,0,null,null,0,null,null,null,0.51742398849247684,null,51.742398849247685,null,154.7629078242702,null,154.7629078242702,null,0.15476290782427021]
[null,70,null,0.99951501764198147,null,-3.3780669691048051E-2,null,null,1.0381029098748014,null,null,34.539700656963234,null,0,null,0,null,0,null,null,1.0406112877297279E+98,null,null,null,0,null,null,0,null,null,null,0.51879972413885223,null,51.87997241388522,null,155.17439405947721,null,155.17439405947721,null,0.15517439405947722]
[null,80,null,0.99944575365128396,null,-3.6113054937051581E-2,null,null,1.0407315113779154,null,null,32.304417393154679,null,0,null,0,null,0,null,null,1.0406112877297279E+98,null,null,null,0,null,null,0,null,null,null,0.52007734486887025,null,52.007734486887024,null,155.5565338590838,null,155.5565338590838,null,0.1555565338590838]
[null,90,null,0.99937649446041454,null,-3.8303679053027249E-2,null,null,1.0431999451865688,null,null,30.452640836967877,null,0,null,0,null,0,null,null,1.0406112877297279E+98,null,null,null,0,null,null,0,null,null,null,0.52127475212092489,null,52.127475212092492,null,155.91468159150293,null,155.91468159150293,null,0.15591468159150293]
[null,100,null,0.99930724006904081,null,-4.0375622857215854E-2,null,null,1.0455342671642218,null,null,28.885874181276719,null,0,null,0,null,0,null,null,1.0406112877297279E+98,null,null,null,0,null,null,0,null,null,null,0.52240498145874281,null,52.240498145874284,null,156.25273622893602,null,156.25273622893602,null,0.15625273622893601]
[null,110,null,0.99923799047683015,null,-4.2346310503029012E-2,null,null,1.0477541484646413,null,null,27.537750724911323,null,0,null,0,null,0,null,null,1.0406112877297279E+98,null,null,null,0,null,null,0,null,null,null,0.5234778749127853,null,52.347787491278531,null,156.57364154918798,null,156.57364154918798,null,0.15657364154918801]
[null,120,null,0.99916874568344993,null,-4.422927882443662E-2,null,null,1.04987487245692,null,null,26.361703257431479,null,3.3250149621870995E-304,null,0,null,3.100730667455365E-306,null,null,1.0406112877297279E+98,null,null,null,0,null,null,0,null,null,null,0.52450107971867632,null,52.450107971867631,null,156.8796848610198,null,156.8796848610198,null,0.15687968486101983]
[null,130,null,0.99909950568856754,null,-4.6035292954868565E-2,null,null,1.0519085938692632,null,null,25.323964066239185,null,6.8097871755185471E-281,null,0,null,6.3486750837348906E-283,null,null,1.0406112877297279E+98,null,null,null,0,null,null,0,null,null,null,0.52548067808216847,null,52.54806780821685,null,157.17268536854488,null,157.17268536854488,null,0.1571726853685449]
[null,140,null,0.99903027049185067,null,-4.7773081223125902E-2,null,null,1.0538651682492399,null,null,24.399370014080592,null,6.5383956143052714E-261,null,0,null,6.0939643063427679E-263,null,null,1.0406112877297279E+98,null,null,null,0,null,null,0,null,null,null,0.52642160204898891,null,52.642160204898893,null,157.4541182599169,null,157.4541182599169,null,0.1574541182599169]
[null,150,null,0.9989610400929666,null,-4.944983702361614E-2,null,null,1.0557527184266551,null,null,23.568734227113051,null,1.3630985804506763E-243,null,0,null,1.2700919262873823E-245,null,null,1.0406112877297279E+98,null,null,null,0,null,null,0,null,null,null,0.52732791684023417,null,52.732791684023418,null,157.72519945370908,null,157.72519945370908,null,0.15772519945370911]
[null,160,null,0.99889181449158293,null,-5.1071572070703002E-2,null,null,1.0575780332424947,null,null,22.817136814944973,null,1.9480597248254141E-228,null,0,null,1.8146353387347483E-230,null,null,1.0406112877297279E+98,null,null,null,0,null,null,0,null,null,null,0.52820302029601751,null,52.820302029601748,null,157.98694525304609,null,157.98694525304609,null,0.1579869452530461]
[null,170,null,0.99882259368736726,null,-5.2643371528463337E-2,null,null,1.0593468555284369,null,null,22.132777486895375,null,4.5975015003756531E-215,null,0,null,4.2814237267902343E-217,null,null,1.0406112877297279E+98,null,null,null,0,null,null,0,null,null,null,0.52904978692673499,null,52.904978692673495,null,158.24021543172529,null,158.24021543172529,null,0.15824021543172531]
[null,180,null,0.99875337767998706,null,-5.4169582405577364E-2,null,null,1.0610640947639103,null,null,21.506184049655577,null,3.5503205514608871E-203,null,0,null,3.3053173404588277E-205,null,null,1.0406112877297279E+98,null,null,null,0,null,null,0,null,null,null,0.52987067429020662,null,52.987067429020662,null,158.48574505190624,null,158.48574505190624,null,0.15848574505190624]
[null,190,null,0.99868416646910996,null,-5.5653955385987171E-2,null,null,1.0627339871759742,null,null,20.929653282262564,null,1.5392283865782988E-192,null,0,null,1.432609912707443E-194,null,null,1.0406112877297279E+98,null,null,null,0,null,null,0,null,null,null,0.53066780308061579,null,53.066780308061581,null,158.72416841892792,null,158.72416841892792,null,0.15872416841892792]
[null,200,null,0.99861496005440364,null,-5.7099753433935807E-2,null,null,1.0643602183366612,null,null,20.396847637365216,null,5.7703626480481704E-183,null,0,null,5.3691719959081469E-185,null,null,1.0406112877297279E+98,null,null,null,0,null,null,0,null,null,null,0.53144301845888064,null,53.144301845888066,null,158.95603742538799,null,158.95603742538799,null,0.158956037425388]
[null,210,null,0.99854575843553561,null,-5.8509836218597275E-2,null,null,1.0659460184668228,null,null,19.902498914547753,null,2.6534868789303095E-174,null,0,null,2.4683145417461297E-176,null,null,1.0406112877297279E+98,null,null,null,0,null,null,0,null,null,null,0.5321979377306465,null,53.219793773064652,null,159.18183581175865,null,159.18183581175865,null,0.15918183581175865]
[null,220,null,0.99847656161217369,null,-5.9886726629845864E-2,null,null,1.0674942375250875,null,null,19.442186912894638,null,1.9924496064679681E-166,null,0,null,1.8528927439641538E-168,null,null,1.0406112877297279E+98,null,null,null,0,null,null,0,null,null,null,0.53293398791242919,null,53.293398791242922,null,159.40199040252116,null,159.40199040252116,null,0.15940199040252118]
[null,230,null,0.99840736958398546,null,-6.1232663820453732E-2,null,null,1.0690074050880458,null,null,19.012171625594174,null,3.0942236007634527E-159,null,0,null,2.8766964316295657E-161,null,null,1.0406112877297279E+98,null,null,null,0,null,null,0,null,null,null,0.53365243568987886,null,53.365243568987886,null,159.61688006676334,null,159.61688006676334,null,0.15961688006676336]
[null,240,null,0.99833818235063865,null,-6.2549645967499415E-2,null,null,1.0704877786254172,null,null,18.609264313973551,null,1.2101601501380399E-152,null,0,null,1.1247723249965E-154,null,null,1.0406112877297279E+98,null,null,null,0,null,null,0,null,null,null,0.53435441157073593,null,53.435441157073591,null,159.82684294239357,null,159.82684294239357,null,0.15982684294239358]
[null,250,null,0.99826899991180085,null,-6.3839465088378747E-2,null,null,1.0719373828062455,null,null,18.230727244524164,null,1.4064031818298452E-146,null,0,null,1.306805870247082E-148,null,null,1.0406112877297279E+98,null,null,null,0,null,null,0,null,null,null,0.535040929551032,null,53.504092955103197,null,160.0321823183545,null,160.0321823183545,null,0.1600321823183545]
[null,260,null,0.9981998222671401,null,-6.5103735644593722E-2,null,null,1.07335804179244,null,null,17.874194849939887,null,5.5866211451878587E-141,null,0,null,5.1895529517635594E-143,null,null,1.0406112877297279E+98,null,null,null,0,null,null,0,null,null,null,0.53571290327310961,null,53.571290327310962,null,160.23317146753027,null,160.23317146753027,null,0.16023317146753027]
[null,270,null,0.9981306494163239,null,-6.6343918236654933E-2,null,null,1.0747514059908365,null,null,17.537611105933959,null,8.5457793455213805E-136,null,0,null,7.9361875102616158E-138,null,null,1.0406112877297279E+98,null,null,null,0,null,null,0,null,null,null,0.53637115941137037,null,53.63711594113704,null,160.4300576504597,null,160.4300576504597,null,0.1604300576504597]
[null,280,null,0.99806148135902029,null,-6.7561339382096103E-2,null,null,1.0761189743835284,null,null,17.219179323945045,null,5.5758374460975396E-131,null,0,null,5.1766630356424803E-133,null,null,1.0406112877297279E+98,null,null,null,0,null,null,0,null,null,null,0.53701644884588695,null,53.701644884588696,null,160.62306545739386,null,160.62306545739386,null,0.16062306545739388]
[null,290,null,0.99799231809489686,null,-6.8757208140045822E-2,null,null,1.0774621132982474,null,null,16.917321551580635,null,1.6947085235056095E-126,null,0,null,1.572948055541966E-128,null,null,1.0406112877297279E+98,null,null,null,0,null,null,0,null,null,null,0.53764945605497216,null,53.764945605497218,null,160.8123996176387,null,160.8123996176387,null,0.16081239961763871]
[null,300,null,0.99792315962362155,null,-6.9932630175937163E-2,null,null,1.0787820722888408,null,null,16.63064548088715,null,2.5898513423603848E-122,null,0,null,2.4031108619989788E-124,null,null,1.0406112877297279E+98,null,null,null,0,null,null,0,null,null,null,0.53827080706189911,null,53.827080706189911,null,160.99824737644039,null,160.99824737644039,null,0.16099824737644039]
[null,310,null,0.99785400594486229,null,-7.1088619732241315E-2,null,null,1.0800799976517557,null,null,16.35791727691247,null,2.1268594064991484E-118,null,0,null,1.9729559260475944E-120,null,null,1.0406112877297279E+98,null,null,null,0,null,null,0,null,null,null,0.53888107619886094,null,53.888107619886092,null,161.18078051810394,null,161.18078051810394,null,0.16118078051810394]
[null,320,null,0.9977848570582869,null,-7.2226109874103162E-2,null,null,1.0813569439949371,null,null,16.098039114171762,null,9.9486789234222815E-115,null,0,null,9.226217222910263E-117,null,null,1.0406112877297279E+98,null,null,null,0,null,null,0,null,null,null,0.53948079189648712,null,53.948079189648709,null,161.36015709765314,null,161.36015709765314,null,0.16136015709765317]
[null,330,null,0.99771571296356332,null,{"$f":"($M$18-$M$14-($I$36*B149))/POWER(4*$S$36*B149,0.5)","v":-7.3345961304333837E-2},null,null,1.0826138841915431,null,null,{"$f":"($M$18-(B149*$I$36))/POWER(4*$S$36*B149,0.5)","v":15.850030486368144},null,2.7897781705032427E-111,null,0,null,2.586471035620496E-113,null,null,{"$f":"(2+$I$36/$C$42)*EXP(IF(($C$42*($C$42+$I$36)*B149+($C$42+$I$36)*$M$18)/$S$36>225,225,($C$42*($C$42+$I$36)*B149+($C$42+$I$36)*$M$18)/$S$36))","v":1.0406112877297279E+98},null,null,null,0,null,null,0,null,null,null,0.54007044166520901,null,54.007044166520899,null,161.53652293077036,null,161.53652293077036,null,0.16153652293077037]
[null,340,null,0.99764657366035947,null,-7.4448969984598504E-2,null,null,1.0838517179858411,null,null,15.613012562484375,null,4.9062916221515603E-108,null,0,null,4.5474823413251558E-110,null,null,1.0406112877297279E+98,null,null,null,0,null,null,0,null,null,null,0.54065047640223429,null,54.065047640223426,null,161.71001288202419,null,161.71001288202419,null,0.16171001288202419]
[null,350,null,0.99757743914834329,null,-7.5535873754650262E-2,null,null,1.0850712794678654,null,null,15.386195019289069,null,5.6322045706420241E-105,null,0,null,5.2188621633219859E-107,null,null,1.0406112877297279E+98,null,null,null,0,null,null,0,null,null,null,0.54122131413248475,null,54.122131413248475,null,161.880751983794,null,161.880751983794,null,0.16188075198379404]
[null,360,null,0.99750830942718283,null,-7.6607358106054499E-2,null,null,1.0862733435934493,null,null,15.168864899904397,null,4.372985189090365E-102,null,0,null,4.0509341503474702E-104,null,null,1.0406112877297279E+98,null,null,null,0,null,null,0,null,null,null,0.5417833432718574,null,54.178334327185738,null,162.04885641232022,null,162.04885641232022,null,0.16204885641232025]
[null,370,null,0.99743918449654612,null,-7.7664061238774312E-2,null,null,1.0874586318945567,null,null,14.960377140014247,null,2.3703751707789808E-99,null,0,null,2.19519985599192E-101,null,null,1.0406112877297279E+98,null,null,null,0,null,null,0,null,null,null,0.5423369254853182,null,54.23369254853182,null,162.21443434256773,null,162.21443434256773,null,0.16221443434256774]
[null,380,null,0.99737006435610098,null,-7.8706578506570216E-2,null,null,1.0886278174995256,null,null,14.760146474517855,null,9.2280926009204084E-97,null,0,null,8.5437542308001861E-99,null,null,1.0406112877297279E+98,null,null,null,0,null,null,0,null,null,null,0.54288239819967177,null,54.288239819967174,null,162.37758669980209,null,162.37758669980209,null,0.1623775866998021]
[null,390,null,0.99730094900551569,null,-7.9735466339149935E-2,null,null,1.0897815295625042,null,null,14.567640493032169,null,2.6467678885169477E-94,null,0,null,2.449810630494739E-96,null,null,1.0406112877297279E+98,null,null,null,0,null,null,0,null,null,null,0.54342007682068394,null,54.342007682068392,null,162.53840782273693,null,162.53840782273693,null,0.16253840782273696]
[null,400,null,0.99723183844445817,null,-8.0751245714431708E-2,null,null,1.0909203571849033,null,null,14.382373656352536,null,5.7223838338623427E-92,null,0,null,5.295092187405857E-94,null,null,1.0406112877297279E+98,null,null,null,0,null,null,0,null,null,null,0.54395025669599306,null,54.395025669599306,null,162.69698605064596,null,162.69698605064596,null,0.16269698605064595]
[null,410,null,0.99716273267259659,null,-8.1754405242429246E-2,null,null,1.0920448528983107,null,null,14.203902120568815,null,9.5207927536579072E-90,null,0,null,8.80743734728796E-92,null,null,1.0406112877297279E+98,null,null,null,0,null,null,0,null,null,null,0.54447321485856159,null,54.447321485856158,null,162.85340424483394,null,162.85340424483394,null,0.16285340424483397]
[null,420,null,0.99709363168959908,null,-8.274540391256878E-2,null,null,1.093155535767359,null,null,14.031819243078333,null,1.2420158973938434E-87,null,0,null,1.1486389623827637E-89,null,null,1.0406112877297279E+98,null,null,null,0,null,null,0,null,null,null,0.54498921157993274,null,54.498921157993273,null,163.00774025322013,null,163.00774025322013,null,0.16300774025322015]
[null,430,null,0.99702453549513381,null,-8.3724673548273496E-2,null,null,1.0942528941620431,null,null,13.865751666803607,null,1.2921310385636763E-85,null,0,null,1.1946561241324125E-87,null,null,1.0406112877297279E+98,null,null,null,0,null,null,0,null,null,null,0.54549849175805842,null,54.549849175805839,null,163.16006732544116,null,163.16006732544116,null,0.16316006732544119]
[null,440,null,0.99695544408886894,null,-8.4692621006058025E-2,null,null,1.0953373882415327,null,null,13.705355896701116,null,1.0887022851114705E-83,null,0,null,1.0062953895696221E-85,null,null,1.0406112877297279E+98,null,null,null,0,null,null,0,null,null,null,0.54600128616073951,null,54.600128616073953,null,163.31045448476752,null,163.31045448476752,null,0.16331045448476753]
[null,450,null,0.9968863574704725,null,-8.5649630150903711E-2,null,null,1.0964094521853529,null,null,13.550315297048529,null,7.5342053379058522E-82,null,0,null,6.9619968440075512E-84,null,null,1.0406112877297279E+98,null,null,null,0,null,null,0,null,null,null,0.5464978125426263,null,54.649781254262628,null,163.45896686220127,null,163.45896686220127,null,0.16345896686220127]
[null,460,null,0.99681727563961287,null,-8.6596063635118015E-2,null,null,1.0974694962026486,null,null,13.400337449722549,null,4.3377401865168382E-80,null,0,null,4.0071901820199768E-82,null,null,1.0406112877297279E+98,null,null,null,0,null,null,0,null,null,null,0.54698827665115124,null,54.698827665115125,null,163.60566599735327,null,163.60566599735327,null,0.16360566599735329]
[null,470,null,0.99674819859595831,null,-8.7532264504057128E-2,null,null,1.0985179083459269,null,null,13.255151823272435,null,2.1022545228916848E-78,null,0,null,1.9415196517781458E-80,null,null,1.0406112877297279E+98,null,null,null,0,null,null,0,null,null,null,0.54747287313460136,null,54.747287313460134,null,163.75061011005022,null,163.75061011005022,null,0.16375061011005024]
[null,480,null,0.99667912633917688,null,-8.845855764887324E-2,null,null,1.0995550561520482,null,null,13.114507710479085,null,8.6691378431302143E-77,null,2.9768184056192549E-307,null,8.0041000369342369E-79,null,null,1.0406112877297279E+98,null,null,null,0,null,null,0,null,null,null,0.54795178636372399,null,54.795178636372398,null,163.89385434607894,null,163.89385434607894,null,0.16389385434607895]
[null,490,null,0.99661005886893705,null,-8.9375251123730251E-2,null,null,1.1005812881301547,null,null,12.978172398599513,null,3.072042034525126E-75,null,4.5515767204237644E-301,null,2.8355929308257408E-77,null,null,1.0406112877297279E+98,null,null,null,0,null,null,0,null,null,null,0.54842519117672195,null,54.842519117672197,null,164.03545100001651,null,164.03545100001651,null,0.16403545100001651]
[null,500,null,0.9965409961849071,null,-9.0282637342628952E-2,null,null,1.1015969351136408,null,null,12.845929541894064,null,9.4403380616617119E-74,null,3.9380330661744446E-295,null,8.7113294259756297E-76,null,null,1.0406112877297279E+98,null,null,null,0,null,null,0,null,null,null,0.54889325355619401,null,54.889325355619398,null,164.17544971770505,null,164.17544971770505,null,0.16417544971770506]
[null,510,null,0.99647193828675529,null,-9.1180994169023352E-2,null,null,1.1026023114910433,null,null,12.717577710527117,null,2.5368570029601058E-72,null,1.9936534439863213E-289,null,2.3403082572009685E-74,null,null,1.0406112877297279E+98,null,null,null,0,null,null,0,null,null,null,0.54935613124546834,null,54.935613124546833,null,164.31389768059867,null,164.31389768059867,null,0.16431389768059868]
[null,520,null,0.99640288517414999,null,-9.2070585909737129E-2,null,null,1.103597716328852,null,null,12.592929093687291,null,6.0077455188430885E-71,null,6.0911441647283165E-284,null,5.540753375325772E-73,null,null,1.0406112877297279E+98,null,null,null,0,null,null,0,null,null,null,0.54981397431083556,null,54.981397431083558,null,164.45083977392886,null,164.45083977392886,null,0.16445083977392885]
[null,530,null,0.99633383684675969,null,-9.2951664223256916E-2,null,null,1.1045834343976151,null,null,12.471808337923198,null,1.2628151062976605E-69,null,1.1556859906684183E-278,null,1.1643332550450484E-71,null,null,1.0406112877297279E+98,null,null,null,0,null,null,0,null,null,null,0.5502669256553735,null,55.026692565537353,null,164.58631874039085,null,164.58631874039085,null,0.16458631874039087]
[null,540,null,0.99626479330425255,null,-9.3824468951249129E-2,null,null,1.1055597371113342,null,null,12.354051504342783,null,2.3716812573567124E-68,null,1.398189451432449E-273,null,2.1861206366757047E-70,null,null,1.0406112877297279E+98,null,null,null,0,null,null,0,null,null,null,0.55071512148936352,null,55.07151214893635,null,164.72037532084647,null,164.72037532084647,null,0.16472037532084649]
[null,550,null,0.99619575454629716,null,-9.468922888108619E-2,null,null,1.1065268833889357,null,null,12.239505130564298,null,4.0043102414900152E-67,null,1.1054395678410369E-268,null,3.6899953332694606E-69,null,null,1.0406112877297279E+98,null,null,null,0,null,null,0,null,null,null,0.55115869176170162,null,55.115869176170165,null,164.85304838336037,null,164.85304838336037,null,0.16485304838336037]
[null,560,null,0.99612672057256191,null,-9.5546162446251803E-2,null,null,1.1074851204455809,null,null,12.128025385205607,null,6.112657621000408E-66,null,5.8430984324908878E-264,null,5.6312977897726944E-68,null,null,1.0406112877297279E+98,null,null,null,0,null,null,0,null,null,null,0.55159776055618259,null,55.159776055618259,null,164.98437504172955,null,164.98437504172955,null,0.16498437504172958]
[null,570,null,0.99605769138271527,null,-9.6395478370701337E-2,null,null,1.1084346845206741,null,null,12.019477304312691,null,8.4813654680120806E-65,null,2.1090776744720678E-259,null,7.8113222010894832E-67,null,null,1.0406112877297279E+98,null,null,null,0,null,null,0,null,null,null,0.5520324464560955,null,55.203244645609551,null,165.11439076453502,null,165.11439076453502,null,0.16511439076453502]
[null,580,null,0.99598866697642574,null,-9.7237376262562555E-2,null,null,1.1093758015486479,null,null,11.91373410050471,null,1.0749258115156395E-63,null,5.302131672126974E-255,null,9.8973207348787124E-66,null,null,1.0406112877297279E+98,null,null,null,0,null,null,0,null,null,null,0.55246286288017077,null,55.246286288017075,null,165.24312947562433,null,165.24312947562433,null,0.16524312947562433]
[null,590,null,0.99591964735336191,null,-9.8072047161961398E-2,null,null,1.110308687777936,null,null,11.810676536790496,null,1.2501628039420519E-62,null,9.4559157066635765E-251,null,1.1507636419225604E-64,null,null,1.0406112877297279E+98,null,null,null,0,null,null,0,null,null,null,0.55288911839258803,null,55.288911839258802,null,165.37062364683587,null,165.37062364683587,null,0.16537062364683588]
[null,600,null,0.99585063251319206,null,-9.8899674047232281E-2,null,null,1.1112335503429351,null,null,11.7101923580211,null,1.3399703752491451E-61,null,1.2170432434382943E-246,null,1.2330911728786405E-63,null,null,1.0406112877297279E+98,null,null,null,0,null,null,0,null,null,null,0.55331131698944602,null,55.331131698944603,null,165.49690438368273,null,165.49690438368273,null,0.16549690438368272]
[null,610,null,0.9957816224555851,null,-9.9720432303312873E-2,null,null,1.1121505877932547,null,null,11.612175773811773,null,1.3289457865455365E-60,null,1.1487438043370955E-242,null,1.2226093617983621E-62,null,null,1.0406112877297279E+98,null,null,null,0,null,null,0,null,null,null,0.55372955836384996,null,55.372955836384996,null,165.62200150464102,null,165.62200150464102,null,0.16562200150464104]
[null,620,null,0.99571261718020931,null,-0.10053449015571929,null,null,1.1130599905840843,null,null,11.516526987515531,null,1.2241461344990508E-59,null,8.0718146433798353E-239,null,1.1258854470526665E-61,null,null,1.0406112877297279E+98,null,null,null,0,null,null,0,null,null,null,0.55414393815152885,null,55.414393815152884,null,165.74594361461479,null,165.74594361461479,null,0.16574594361461478]
[null,630,null,0.9956436166867334,null,-0.10134200907314415,null,null,1.1139619415311206,null,null,11.423151766478282,null,1.0509939023682257E-58,null,4.2820564427654794E-235,null,9.663660213591712E-61,null,null,1.0406112877297279E+98,null,null,null,0,null,null,0,null,null,null,0.55455454815871019,null,55.455454815871022,null,165.86875817309374,null,165.86875817309374,null,0.16586875817309377]
[null,640,null,0.99557462097482607,null,-0.102143144141406,null,null,1.1148566162331282,null,null,11.331961049366432,null,8.4380024033874862E-58,null,1.7377520743607361E-231,null,7.7564257873822856E-60,null,null,1.0406112877297279E+98,null,null,null,0,null,null,0,null,null,null,0.5549614765737868,null,55.496147657378678,null,165.99047155746362,null,165.99047155746362,null,0.16599047155746363]
[null,650,null,0.99550563004415582,null,{"$f":"($M$18-$M$14-($I$36*B181))/POWER(4*$S$36*B181,0.5)","v":-0.10293804441120329},null,null,{"$f":"IF(F181>0,ERFC(IF(F181<27,F181,27)),1+ERF(IF(-F181<27,-F181,27)))","v":1.1157441834649109},null,null,{"$f":"($M$18-(B181*$I$36))/POWER(4*$S$36*B181,0.5)","v":11.242870586845598},null,{"$f":"IF(L181>0,ERFC(IF(L181<27,L181,27)),1+ERF(IF(-L181<27,-L181,27)))","v":6.3547010940538327E-57},null,{"$f":"IF(($M$18+$M$14+$I$36*B181)/POWER(4*$S$36*B181,0.5)>27,ERFC(27),ERFC(($M$18+$M$14+$I$36*B181)/POWER(4*$S$36*B181,0.5)))","v":5.461933917053787E-228},null,{"$f":"IF(($M$18+$I$36*B181)/(POWER(4*$S$36*B181,0.5))>27,ERFC(27),ERFC(($M$18+$I$36*B181)/(POWER(4*$S$36*B181,0.5))))","v":5.8397962299718586E-59},null,null,{"$f":"(2+$I$36/$C$42)*EXP(IF(($C$42*($C$42+$I$36)*B181+($C$42+$I$36)*$M$18)/$S$36>225,225,($C$42*($C$42+$I$36)*B181+($C$42+$I$36)*$M$18)/$S$36))","v":1.0406112877297279E+98},null,null,null,{"$f":"IF(($M$18+((2*$C$42+$I$36)*B181))/POWER(4*$S$36*B181,0.5)>27,ERFC(27),ERFC(($M$18+((2*$C$42+$I$36)*B181))/POWER(4*$S$36*B181,0.5)))","v":0},null,null,{"$f":"IF(($M$18+$M$14+((2*$C$42+$I$36)*B181))/POWER(4*$S$36*B181,0.5)>27,ERFC(27),ERFC(($M$18+$M$14+((2*$C$42+$I$36)*B181))/POWER(4*$S$36*B181,0.5)))","v":0},null,null,null,0.55536480816416911,null,55.536480816416912,null,166.11110912188505,null,166.11110912188505,null,0.16611110912188506]
[null,{"$f":"B181+$M$20","v":660},null,{"$f":"EXP(-0.693/$M$6*B182)","v":0.99543664389439146},null,-0.10372685322188113,null,null,1.116624805543186,null,null,11.155800612313486,null,4.5022412338376585E-56,null,1.3451535874184987E-224,null,4.136298983525049E-58,null,null,1.0406112877297279E+98,null,null,null,0,null,null,0,null,null,null,{"$f":"0.5*D182*((I182-N182)+($Q$44)*(P182-R182)+U182*(Y182-($Q$84*AB182)))","v":0.55576462445956831},null,{"$f":"$M$4*AF182","v":55.576462445956828},null,{"$f":"AF182*$M$25","v":166.23069525211412},null,{"$f":"AF182*$M$27","v":166.23069525211412},null,{"$f":"AF182*$M$28","v":0.16623069525211412}]
[null,670,null,0.9953676625252017,null,-0.10450970850320312,null,null,1.1174986386676093,null,null,11.070675539760416,null,3.0090356682193914E-55,null,2.6242586413841863E-221,null,2.7637014167187603E-57,null,null,1.0406112877297279E+98,null,null,null,0,null,null,0,null,null,null,0.55616100392283663,null,55.616100392283663,null,166.34925341660116,null,166.34925341660116,null,0.16634925341660117]
[null,680,null,0.99529868593625503,null,-0.10528674305692667,null,null,1.1183658332389854,null,null,10.987423686154992,null,1.9019883495043176E-54,null,4.0974560027211887E-218,null,1.7464344437631333E-56,null,null,1.0406112877297279E+98,null,null,null,0,null,null,0,null,null,null,0.55655402210938354,null,55.655402210938355,null,166.46680621417252,null,166.46680621417252,null,0.16646680621417254]
[null,690,null,0.9952297141272205,null,-0.10605808481981045,null,null,1.1192265341564998,null,null,10.905977016036289,null,1.1397840605593212E-53,null,5.1701089908773621E-215,null,1.0462794424938372E-55,null,null,1.0406112877297279E+98,null,null,null,0,null,null,0,null,null,null,0.55694375181608657,null,55.694375181608656,null,166.58337541857023,null,166.58337541857023,null,0.16658337541857024]
[null,700,null,0.9951607470977667,null,-0.1068238571095283,null,null,1.1200808810956415,null,null,10.826270906243218,null,6.4902836090932105E-53,null,5.3201933202377772E-212,null,5.956203016202896E-55,null,null,1.0406112877297279E+98,null,null,null,0,null,null,0,null,null,null,0.5573302632205317,null,55.733026322053171,null,166.69898202009918,null,166.69898202009918,null,0.1666989820200992]
[null,710,null,0.99509178484756233,null,-0.10758417885482853,null,null,1.1209290087683255,null,null,10.748243928931192,null,3.5193901955167469E-52,null,4.503380935359315E-209,null,3.2288953422821697E-54,null,null,1.0406112877297279E+98,null,null,null,0,null,null,0,null,null,null,0.55771362401134095,null,55.771362401134098,null,166.81364626460842,null,166.81364626460842,null,0.16681364626460843]
[null,720,null,0.99502282737627634,null,-0.10833916481115473,null,null,1.1217710471665889,null,null,10.671837651219422,null,1.8210341788714702E-51,null,3.1613088303746292E-206,null,1.6702650899271384E-53,null,null,1.0406112877297279E+98,null,null,null,0,null,null,0,null,null,null,0.55809389951027277,null,55.809389951027278,null,166.92738769001176,null,166.92738769001176,null,0.16692738769001178]
[null,730,null,0.99495387468357765,null,-0.10908892576283516,null,null,1.122607121791114,null,null,10.596996449983122,null,9.0084806957607908E-51,null,1.8546072314010846E-203,null,8.2603727308190379E-53,null,null,1.0406112877297279E+98,null,null,null,0,null,null,0,null,null,null,0.55847115278672388,null,55.847115278672391,null,167.04022516053553,null,167.04022516053553,null,0.16704022516053554]
[null,740,null,0.99488492676913487,null,-0.10983356871284923,null,null,1.1234373538657134,null,null,10.523667340455857,null,4.2683346851702706E-50,null,9.1591054690203974E-201,null,3.9127974768899226E-52,null,null,1.0406112877297279E+98,null,null,null,0,null,null,0,null,null,null,0.55884544476520048,null,55.884544476520048,null,167.15217689886353,null,167.15217689886353,null,0.16715217689886352]
[null,750,null,0.99481598363261703,null,-0.11057319706109156,null,null,1.1242618605388215,null,null,10.451799817441275,null,1.940382562038882E-49,null,3.8340791906759435E-198,null,1.7782675604239571E-51,null,null,1.0406112877297279E+98,null,null,null,0,null,null,0,null,null,null,0.55921683432628189,null,55.921683432628186,null,167.26326051633552,null,167.26326051633552,null,0.16726326051633553]
[null,760,null,0.99474704527369306,null,-0.11130791077197434,null,null,1.1250807550729367,null,null,10.381345708052299,null,8.4771015969167436E-49,null,1.3693341149210811E-195,null,7.7667262294939426E-51,null,null,1.0406112877297279E+98,null,null,null,0,null,null,0,null,null,null,0.55958537840154965,null,55.958537840154968,null,167.37349304134085,null,167.37349304134085,null,0.16737349304134086]
[null,770,null,0.99467811169203169,null,-0.11203780653213724,null,null,1.1258941470228896,null,null,10.312259035001597,null,3.5646004655338811E-48,null,4.1984052249696102E-193,null,3.2649937989666969E-50,null,null,1.0406112877297279E+98,null,null,null,0,null,null,0,null,null,null,0.55995113206291924,null,55.995113206291926,null,167.48289094603763,null,167.48289094603763,null,0.16748289094603763]
[null,780,null,0.99460918288730216,null,-0.11276297789896926,null,null,1.1267021424037258,null,null,10.244495889561303,null,1.4448262728964244E-47,null,1.1115637064257365E-190,null,1.3230250005718215E-49,null,null,1.0406112877297279E+98,null,null,null,0,null,null,0,null,null,null,0.5603141486067712,null,56.031414860677117,null,167.59147017151679,null,167.59147017151679,null,0.16759147017151679]
[null,790,null,0.99454025885917319,null,-0.1134835154405883,null,null,1.1275048438489395,null,null,10.178014313393957,null,5.6528475023395859E-47,null,2.5555178418663378E-188,null,5.1748842045780656E-49,null,null,1.0406112877297279E+98,null,null,null,0,null,null,0,null,null,null,0.5606744796332479,null,56.067447963324788,null,167.69924615151979,null,167.69924615151979,null,0.16769924615151979]
[null,800,null,0.99447133960731393,null,-0.11419950686787161,null,null,1.1283023507597234,null,null,10.112774188531704,null,2.1376720520783734E-46,null,5.1288092276046918E-186,null,1.956389930226922E-48,null,null,1.0406112877297279E+98,null,null,null,0,null,null,0,null,null,null,0.56103217512105175,null,56.103217512105175,null,167.80623383481105,null,167.80623383481105,null,0.16780623383481108]
[null,810,null,0.99440242513139332,null,-0.11491103715908176,null,null,1.1290947594458522,null,null,10.048737134847887,null,7.8231915192558955E-46,null,9.0309254989072488E-184,null,7.1577957466252576E-48,null,null,1.0406112877297279E+98,null,null,null,0,null,null,0,null,null,null,0.56138728349805134,null,56.138728349805135,null,167.91244770629649,null,167.91244770629649,null,0.16791244770629649]
[null,820,null,0.99433351543108039,null,-0.1156181886775895,null,null,1.1298821632587648,null,null,9.9858664144253968,null,2.7740619384998016E-45,null,1.4018595427195068E-181,null,2.5374209355707615E-47,null,null,1.0406112877297279E+98,null,null,null,0,null,null,0,null,null,null,0.5617398517079808,null,56.173985170798076,null,168.0179018069733,null,168.0179018069733,null,0.16801790180697329]
[null,830,null,0.99426461050604431,null,-0.11632104128315521,null,null,1.1306646527173689,null,null,9.9241268422800708,null,9.541855306924824E-45,null,1.9271324281965352E-179,null,8.7254984270404635E-47,null,null,1.0406112877297279E+98,null,null,null,0,null,null,0,null,null,null,0.56208992527349333,null,56.208992527349331,null,168.1226097527896,null,168.1226097527896,null,0.16812260975278961]
[null,840,null,0.994195710355954,null,-0.11701967243719455,null,null,1.1314423156270472,null,null,9.863484702945982,null,3.1871726077832415E-44,null,2.3563376476599682E-177,null,2.9136949522900158E-46,null,null,1.0406112877297279E+98,null,null,null,0,null,null,0,null,null,null,0.56243754835580884,null,56.243754835580887,null,168.22658475248517,null,168.22658475248517,null,0.16822658475248517]
[null,850,null,0.99412681498047861,null,-0.11771415730242102,null,null,1.1322152371923073,null,null,9.8039076724730663,null,1.0348653486233237E-43,null,2.5732253869922204E-175,null,9.4580901394962565E-46,null,null,1.0406112877297279E+98,null,null,null,0,null,null,0,null,null,null,0.56278276381117776,null,56.278276381117777,null,168.32983962447986,null,168.32983962447986,null,0.16832983962447987]
[null,860,null,0.99405792437928742,null,-0.1184045688372283,null,null,1.1329835001234907,null,null,9.7453647454268921,null,3.2696113632722963E-43,null,2.519674334212106E-173,null,2.9874240303321945E-45,null,null,1.0406112877297279E+98,null,null,null,0,null,null,0,null,null,null,0.56312561324436861,null,56.312561324436864,null,168.43238681287193,null,168.43238681287193,null,0.16843238681287195]
[null,870,null,0.99398903855204934,null,-0.11909097788514773,null,null,1.1337471847379121,null,null,9.6878261665157712,null,1.0061234713470346E-42,null,2.2206009011978135E-171,null,9.1903737977104988E-45,null,null,1.0406112877297279E+98,null,null,null,0,null,null,0,null,null,null,0.56346613705936499,null,56.346613705936498,null,168.53423840260166,null,168.53423840260166,null,0.16853423840260168]
[null,880,null,0.99392015749843377,null,-0.11977345325969173,null,null,1.1345063690557882,null,null,9.6312633665025498,null,3.0181410996436735E-42,null,1.7677267382859905E-169,null,2.7561485427853762E-44,null,null,1.0406112877297279E+98,null,null,null,0,null,null,0,null,null,null,0.56380437450745258,null,56.380437450745255,null,168.63540613383424,null,168.63540613383424,null,0.16863540613383424]
[null,890,null,0.99385128121810984,null,-0.1204520618248703,null,null,1.1352611288912735,null,null,9.5756489020872415,null,8.8335166734083301E-42,null,1.2754610918027379E-167,null,8.0645089094098412E-44,null,null,1.0406112877297279E+98,null,null,null,0,null,null,0,null,null,null,0.56414036373285492,null,56.414036373285491,null,168.73590141560962,null,168.73590141560962,null,0.16873590141560962]
[null,900,null,0.99378240971074672,null,-0.12112686857164759,null,null,1.1360115379389086,null,null,9.5209563994729987,null,2.5245834207925191E-41,null,8.3685369870448701E-166,null,2.3041739234293054E-43,null,null,1.0406112877297279E+98,null,null,null,0,null,null,0,null,null,null,0.56447414181607003,null,56.447414181607002,null,168.83573533880457,null,168.83573533880457,null,0.16883573533880458]
[null,910,null,0.99371354297601366,null,-0.12179793669058603,null,null,1.1367576678557612,null,null,9.4671605013516267,null,7.0509613307156496E-41,null,5.0086692049929597E-164,null,6.4336159059196903E-43,null,null,1.0406112877297279E+98,null,null,null,0,null,null,0,null,null,null,0.56480574481504953,null,56.480574481504952,null,168.93491868844947,null,168.93491868844947,null,0.16893491868844948]
[null,920,null,0.99364468101358006,null,-0.12246532764090746,null,null,1.1374995883395149,null,null,9.4142368170664064,null,1.9259063767704198E-40,null,2.7427533478842327E-162,null,1.7568037878711363E-42,null,null,1.0406112877297279E+98,null,null,null,0,null,null,0,null,null,null,0.56513520780434801,null,56.513520780434803,null,169.03346195543804,null,169.03346195543804,null,0.16903346195543806]
[null,930,null,0.99357582382311493,null,-0.12312910121618539,null,null,1.1382373672027533,null,null,9.362161875729587,null,5.1482775738004921E-40,null,1.3781227608680819E-160,null,4.6949542007398648E-42,null,null,1.0406112877297279E+98,null,null,null,0,null,null,0,null,null,null,0.56546256491236446,null,56.546256491236448,null,169.13137534766631,null,169.13137534766631,null,0.16913137534766631]
[null,940,null,0.9935069714042879,null,-0.12378931560686665,null,null,1.1389710704436573,null,null,9.3109130820897335,null,1.3478052303011841E-39,null,6.3711521885907134E-159,null,1.2287906197601639E-41,null,null,1.0406112877297279E+98,null,null,null,0,null,null,0,null,null,null,0.56578784935678894,null,56.578784935678897,null,169.22866880063475,null,169.22866880063475,null,0.16922866880063475]
[null,950,null,0.9934381237567681,null,-0.12444602745980786,null,null,1.1397007623133319,null,null,9.2604686749602898,null,3.4579333238612434E-39,null,2.7171834348344338E-157,null,3.1517280398423592E-41,null,null,1.0406112877297279E+98,null,null,null,0,null,null,0,null,null,null,0.56611109347835742,null,56.611109347835743,null,169.32535198754456,null,169.32535198754456,null,0.16932535198754456]
[null,960,null,0.99336928088022503,null,-0.12509929193499883,null,null,1.1404265053799509,null,null,9.2108076880355263,null,8.6997019578197043E-39,null,1.0717296567076065E-155,null,7.927164889246829E-41,null,null,1.0406112877297279E+98,null,null,null,0,null,null,0,null,null,null,0.56643232877301497,null,56.6432328773015,null,169.42143432891771,null,169.42143432891771,null,0.16942143432891771]
[null,970,null,0.99330044277432794,null,{"$f":"($M$18-$M$14-($I$36*B213))/POWER(4*$S$36*B213,0.5)","v":-0.12574916275963383},null,null,1.1411483605899047,null,null,{"$f":"($M$18-(B213*$I$36))/POWER(4*$S$36*B213,0.5)","v":9.1619099129334991},null,2.1475985901582486E-38,null,3.9189175939562944E-154,null,1.9563567391941562E-40,null,null,{"$f":"(2+$I$36/$C$42)*EXP(IF(($C$42*($C$42+$I$36)*B213+($C$42+$I$36)*$M$18)/$S$36>225,225,($C$42*($C$42+$I$36)*B213+($C$42+$I$36)*$M$18)/$S$36))","v":1.0406112877297279E+98},null,null,null,0,null,null,0,null,null,null,0.56675158592257535,null,56.675158592257532,null,169.51692500176728,null,169.51692500176728,null,0.16951692500176729]
[null,980,null,0.99323160943874633,null,-0.12639569227968053,null,null,1.1418663873261197,null,null,9.113755864317957,null,5.2049288753544601E-38,null,1.3315824567567958E-152,null,4.7401402234906964E-40,null,null,1.0406112877297279E+98,null,null,null,0,null,null,0,null,null,null,0.56706889482396439,null,56.706889482396441,null,169.61183294834424,null,169.61183294834424,null,0.16961183294834425]
[null,990,null,0.99316278087314958,null,-0.12703893150908702,null,null,1.1425806434637074,null,null,9.0663267469623623,null,1.2391710046284892E-37,null,4.2136343633778503E-151,null,1.1282078269665616E-39,null,null,1.0406112877297279E+98,null,null,null,0,null,null,0,null,null,null,0.56738428461712409,null,56.73842846171241,null,169.70616688448374,null,169.70616688448374,null,0.16970616688448376]
[null,1000,null,0.99309395707720705,null,-0.12767893017675749,null,null,1.1432911854230929,null,null,9.0196044246295131,null,2.8995765198645743E-37,null,1.2443989879049027E-149,null,2.6392099605729649E-39,null,null,1.0406112877297279E+98,null,null,null,0,null,null,0,null,null,null,0.56769778371165514,null,56.769778371165515,null,169.79993530757378,null,169.79993530757378,null,0.16979993530757378]
[null,1010,null,0.99302513805058845,null,-0.12831573677141916,null,null,1.1439980682207569,null,null,8.9735713906496155,null,6.6718725000755493E-37,null,3.4369002415032454E-148,null,6.0711174352522899E-39,null,null,1.0406112877297279E+98,null,null,null,0,null,null,0,null,null,null,0.56800941981226183,null,56.800941981226181,null,169.89314650416603,null,169.89314650416603,null,0.16989314650416604]
[null,1020,null,0.99295632379296306,null,-0.12894939858449495,null,null,1.1447013455177262,null,null,8.9282107400883657,null,1.5103755299510717E-36,null,8.8947596934710667E-147,null,1.3740020805188664E-38,null,null,1.0406112877297279E+98,null,null,null,0,null,null,0,null,null,null,0.56831921994306989,null,56.831921994306988,null,169.98580855724919,null,169.98580855724919,null,0.16998580855724921]
[null,1030,null,0.99288751430400057,null,-0.12957996175108927,null,null,1.1454010696659289,null,null,8.8835061434044285,null,3.365519206268039E-36,null,2.1611447035965902E-145,null,3.0608081075247185E-38,null,null,1.0406112877297279E+98,null,null,null,0,null,null,0,null,null,null,0.56862721047087372,null,56.862721047087369,null,170.07792935320248,null,170.07792935320248,null,0.17007792935320248]
[null,1040,null,0.99281870958337037,null,-0.13020747128918744,null,null,1.1460972917525327,null,null,8.839441821503053,null,7.3849423955129575E-36,null,4.938630163554858E-144,null,6.7144856214380903E-38,null,null,1.0406112877297279E+98,null,null,null,0,null,null,0,null,null,null,0.56893341712737255,null,56.893341712737254,null,170.16951658844638,null,170.16951658844638,null,0.1701695165884464]
[null,1050,null,0.99274990963074217,null,-0.13083197113716274,null,null,1.1467900616423672,null,null,8.7960025220991813,null,1.5964690198378082E-35,null,1.0633170315984977E-142,null,1.4511348223671186E-37,null,null,1.0406112877297279E+98,null,null,null,0,null,null,0,null,null,null,0.5692378650304466,null,56.92378650304466,null,170.26057777580652,null,170.26057777580652,null,0.17026057777580653]
[null,1060,null,0.99268111444578544,null,-0.13145350418967991,null,null,1.1474794280185352,null,null,8.7531734973095769,null,3.4015391869585196E-35,null,2.1606505071431842E-141,null,3.0910384375295745E-37,null,null,1.0406112877297279E+98,null,null,null,0,null,null,0,null,null,null,0.56954057870452601,null,56.954057870452601,null,170.35112025060596,null,170.35112025060596,null,0.17035112025060598]
[null,1070,null,0.9926123240281699,null,-0.13207211233207794,null,null,1.1481654384213051,null,null,8.7109404823991774,null,7.1460898135614207E-35,null,4.1502694102260276E-140,null,6.4920085301723755E-37,null,null,1.0406112877297279E+98,null,null,null,0,null,null,0,null,null,null,0.56984158210009717,null,56.984158210009717,null,170.44115117649963,null,170.44115117649963,null,0.17044115117649963]
[null,1080,null,0.99254353837756504,null,-0.13268783647330987,null,null,1.1488481392853704,null,null,8.6692896756119957,null,1.4808441305696456E-34,null,7.5477325069098034E-139,null,1.3449361607799975E-36,null,null,1.0406112877297279E+98,null,null,null,0,null,null,0,null,null,null,0.57014089861239159,null,57.014089861239157,null,170.53067755106426,null,170.53067755106426,null,0.17053067755106427]
[null,1090,null,0.99247475749364067,null,-0.13330071657751372,null,null,1.1495275759755628,null,null,8.628207719021848,null,3.0280410623636137E-34,null,1.3015435276352514E-137,null,2.7493866453956305E-36,null,null,1.0406112877297279E+98,null,null,null,0,null,null,0,null,null,null,0.57043855109929964,null,57.043855109929964,null,170.6197062111564,null,170.6197062111564,null,0.17061970621115641]
[null,1100,null,0.99240598137606628,null,-0.13391079169428224,null,null,1.150203792821094,null,null,8.5876816803424134,null,6.1120008427035753E-34,null,2.131241465880724E-136,null,5.5480354389908018E-36,null,null,1.0406112877297279E+98,null,null,null,0,null,null,0,null,null,null,0.57073456189854566,null,57.073456189854568,null,170.70824383804953,null,170.70824383804953,null,0.17070824383804953]
[null,1110,null,0.99233721002451181,null,-0.13451809998769781,null,null,1.1508768331484009,null,null,8.5476990356404183,null,1.2182216230116567E-33,null,3.3185278616560557E-135,null,1.1055131511193905E-35,null,null,1.0406112877297279E+98,null,null,null,0,null,null,0,null,null,null,0.57102895284416488,null,57.102895284416491,null,170.79629696236233,null,170.79629696236233,null,0.17079629696236237]
[null,1120,null,0.99226844343864684,null,-0.13512267876419221,null,null,1.1515467393126635,null,null,8.5082476528993798,null,2.3984852316144298E-33,null,4.9201975169382406E-134,null,2.1759878819758024E-35,null,null,1.0406112877297279E+98,null,null,null,0,null,null,0,null,null,null,0.57132174528231294,null,57.132174528231296,null,170.88387196878747,null,170.88387196878747,null,0.17088387196878749]
[null,1130,null,0.99219968161814109,null,-0.13572456449928985,null,null,1.1522135527280584,null,null,8.4693157763848905,null,4.6661322878303018E-33,null,6.9551828706683743E-133,null,4.2321232902749537E-35,null,null,1.0406112877297279E+98,null,null,null,0,null,null,0,null,null,null,0.57161296008644336,null,57.161296008644335,null,170.97097510063108,null,170.97097510063108,null,0.17097097510063108]
[null,1140,null,0.9921309245626645,null,-0.13632379286328819,null,null,1.1528773138968123,null,null,8.4308920117656641,null,8.9726917329382233E-33,null,9.3857372662716241E-132,null,8.1359051577160342E-35,null,null,1.0406112877297279E+98,null,null,null,0,null,null,0,null,null,null,0.57190261767188277,null,57.190261767188275,null,171.05761246417228,null,171.05761246417228,null,0.17105761246417228]
[null,1150,null,0.99206217227188664,null,-0.13692039874592651,null,null,1.1535380624371105,null,null,8.3929653119475098,null,1.7059482547866587E-32,null,1.2105646395628356E-130,null,1.5464321702446995E-34,null,null,1.0406112877297279E+98,null,null,null,0,null,null,0,null,null,null,0.57219073800983156,null,57.219073800983153,null,171.14379003285089,null,171.14379003285089,null,0.17114379003285091]
[null,1160,null,0.99199342474547758,null,-0.13751441628009164,null,null,1.1541958371099179,null,null,8.3555249635802493,null,3.2078461611022526E-32,null,1.4940843667827058E-129,null,2.9071033530650065E-34,null,null,1.0406112877297279E+98,null,null,null,0,null,null,0,null,null,null,0.57247734064082045,null,57.247734064082046,null,171.22951365129222,null,171.22951365129222,null,0.17122951365129224]
[null,1170,null,0.9919246819831069,null,-0.13810587886460571,null,null,1.1548506758447608,null,null,8.3185605742000792,null,5.9674474610251712E-32,null,1.7665268471311546E-128,null,5.4065159292157617E-34,null,null,1.0406112877297279E+98,null,null,null,0,null,null,0,null,null,null,0.57276244468764514,null,57.276244468764517,null,171.31478903917599,null,171.31478903917599,null,0.17131478903917599]
[null,1180,null,0.99185594398444465,null,-0.1386948191861396,null,null,1.1555026157645198,null,null,8.2820620599723362,null,1.0985244506092179E-31,null,2.0030747652457629E-127,null,9.949942700739226E-34,null,null,1.0406112877297279E+98,null,null,null,0,null,null,0,null,null,null,0.5730460688678064,null,57.30460688678064,null,171.39962179495703,null,171.39962179495703,null,0.17139962179495702]
[null,1190,null,0.99178721074916065,null,-0.13928126924029222,null,null,1.1561516932092812,null,null,8.2460196340017919,null,2.0016658369170421E-31,null,2.1805385266101744E-126,null,1.8125267462782973E-33,null,null,1.0406112877297279E+98,null,null,null,0,null,null,0,null,null,null,0.57332823150547618,null,57.332823150547618,null,171.4840173994445,null,171.4840173994445,null,0.17148401739944449]
[null,1200,null,0.99171848227692483,null,-0.13986526035187433,null,null,1.156797943759287,null,null,8.2104237951796701,null,3.6111456451671931E-31,null,2.2811964392401046E-125,null,3.269037272514119E-33,null,null,1.0406112877297279E+98,null,null,null,0,null,null,0,null,null,null,0.57360895054301375,null,57.360895054301373,null,171.56798121924635,null,171.56798121924635,null,0.17156798121924638]
[null,1210,null,0.991649758567407,null,-0.14044682319443327,null,null,1.1574414022570276,null,null,8.1752653175385408,null,6.4517451166557583E-31,null,2.2957358729671853E-124,null,5.8389413848914589E-33,null,null,1.0406112877297279E+98,null,null,null,0,null,null,0,null,null,null,0.57388824355205126,null,57.388824355205124,null,171.65151851008508,null,171.65151851008508,null,0.17165151851008509]
[null,1220,null,0.99158103962027733,null,-0.14102598780905318,null,null,1.1580821028285153,null,null,8.140535240087921,null,1.1418047519633093E-30,null,2.2246179596680898E-123,null,1.0330725734424291E-32,null,null,1.0406112877297279E+98,null,null,null,0,null,null,0,null,null,null,0.57416612774416809,null,57.416612774416805,null,171.73463441999041,null,171.73463441999041,null,0.17173463441999043]
[null,1230,null,0.99151232543520562,null,-0.14160278362246281,null,null,1.1587200789037742,null,null,8.1062248571051914,null,2.0021160464485122E-30,null,2.0776086666379603E-122,null,1.8109661373259022E-32,null,null,1.0406112877297279E+98,null,null,null,0,null,null,0,null,null,null,0.57444261998117307,null,57.444261998117305,null,171.81733399237476,null,171.81733399237476,null,0.17181733399237478]
[null,1240,null,0.99144361601186204,null,-0.14217723946448263,null,null,1.1593553632365825,null,null,8.072325708857873,null,3.4790965189977644E-30,null,1.8716922337015943E-121,null,3.1460794341370265E-32,null,null,1.0406112877297279E+98,null,null,null,0,null,null,0,null,null,null,0.57471773678501159,null,57.471773678501158,null,171.89962216899644,null,171.89962216899644,null,0.17189962216899646]
[null,1250,null,0.9913749113499164,null,-0.14274938358483952,null,null,1.1599879879235016,null,null,8.0388295727348211,null,5.9926306217632883E-30,null,1.6279561332104523E-120,null,5.4175492025166532E-32,null,null,1.0406112877297279E+98,null,null,null,0,null,null,0,null,null,null,0.57499149434731467,null,57.499149434731464,null,171.98150379281591,null,171.98150379281591,null,0.17198150379281593]
[null,1260,null,0.99130621144903897,null,-0.1433192436693777,null,null,1.16061798442222,null,null,8.0057284547651939,null,1.0233715296065036E-29,null,1.3682070003823313E-119,null,9.249129497860182E-32,null,null,1.0406112877297279E+98,null,null,null,0,null,null,0,null,null,null,0.57526390853860532,null,57.526390853860534,null,172.06298361074931,null,172.06298361074931,null,0.17206298361074931]
[null,1270,null,0.99123751630889967,null,-0.1438868468556917,null,null,1.1612453835692458,null,null,7.9730145815053195,null,1.7330139819735839E-29,null,1.1120225855152614E-118,null,1.5658559102765833E-31,null,null,1.0406112877297279E+98,null,null,null,0,null,null,0,null,null,null,0.57553499491717741,null,57.553499491717744,null,172.14406627632422,null,172.14406627632422,null,0.17214406627632423]
[null,1280,null,0.99116882592916855,null,-0.14445221974820632,null,null,1.1618702155969709,null,null,7.940680392274726,null,2.9107780391679895E-29,null,8.7471977417451469E-118,null,2.6293054658590413E-31,null,null,1.0406112877297279E+98,null,null,null,0,null,null,0,null,null,null,0.57580476873765984,null,57.580476873765981,null,172.2247563522412,null,172.2247563522412,null,0.17222475635224122]
[null,1290,null,0.99110014030951588,null,{"$f":"($M$18-$M$14-($I$36*B245))/POWER(4*$S$36*B245,0.5)","v":-0.14501538843272774},null,null,{"$f":"IF(F245>0,ERFC(IF(F245<27,F245,27)),1+ERF(IF(-F245<27,-F245,27)))","v":1.1624925101501407},null,null,{"$f":"($M$18-(B245*$I$36))/POWER(4*$S$36*B245,0.5)","v":7.9087185317237472},null,{"$f":"IF(L245>0,ERFC(IF(L245<27,L245,27)),1+ERF(IF(-L245<27,-L245,27)))","v":4.8499484975469784E-29},null,{"$f":"IF(($M$18+$M$14+$I$36*B245)/POWER(4*$S$36*B245,0.5)>27,ERFC(27),ERFC(($M$18+$M$14+$I$36*B245)/POWER(4*$S$36*B245,0.5)))","v":6.6642011450905885E-117},null,{"$f":"IF(($M$18+$I$36*B245)/(POWER(4*$S$36*B245,0.5))>27,ERFC(27),ERFC(($M$18+$I$36*B245)/(POWER(4*$S$36*B245,0.5))))","v":4.3797702791333234E-31},null,null,{"$f":"(2+$I$36/$C$42)*EXP(IF(($C$42*($C$42+$I$36)*B245+($C$42+$I$36)*$M$18)/$S$36>225,225,($C$42*($C$42+$I$36)*B245+($C$42+$I$36)*$M$18)/$S$36))","v":1.0406112877297279E+98},null,null,null,{"$f":"IF(($M$18+((2*$C$42+$I$36)*B245))/POWER(4*$S$36*B245,0.5)>27,ERFC(27),ERFC(($M$18+((2*$C$42+$I$36)*B245))/POWER(4*$S$36*B245,0.5)))","v":0},null,null,{"$f":"IF(($M$18+$M$14+((2*$C$42+$I$36)*B245))/POWER(4*$S$36*B245,0.5)>27,ERFC(27),ERFC(($M$18+$M$14+((2*$C$42+$I$36)*B245))/POWER(4*$S$36*B245,0.5)))","v":0},null,null,null,0.5760732449592828,null,57.607324495928282,null,172.30505831284626,null,172.30505831284626,null,0.17230505831284629]
[null,{"$f":"B245+$M$20","v":1300},null,{"$f":"EXP(-0.693/$M$6*B246)","v":0.99103145944961168},null,-0.14557637849048766,null,null,1.1631122963017473,null,null,7.8771218427160585,null,8.0180057090577615E-29,null,4.9212019100618855E-116,null,7.2387377467446793E-31,null,null,1.0406112877297279E+98,null,null,null,0,null,null,0,null,null,null,{"$f":"0.5*D246*((I246-N246)+($Q$44)*(P246-R246)+U246*(Y246-($Q$84*AB246)))","v":0.57634043825385495},null,{"$f":"$M$4*AF246","v":57.634043825385497},null,{"$f":"AF246*$M$25","v":172.3849765465169},null,{"$f":"AF246*$M$27","v":172.3849765465169},null,{"$f":"AF246*$M$28","v":0.17238497654651691}]
[null,1310,null,0.99096278334912624,null,-0.14613521501170254,null,null,1.1637296025683765,null,null,7.8458833595105251,null,1.3154505568460079E-28,null,3.5249142057071063E-115,null,1.187280438505206E-30,null,null,1.0406112877297279E+98,null,null,null,0,null,null,0,null,null,null,0.57660636301346546,null,57.660636301346543,null,172.46451535796569,null,172.46451535796569,null,0.17246451535796573]
[null,1320,null,0.99089411200772959,null,-0.14669192260866767,null,null,1.164344456925027,null,null,7.8149963012275707,null,2.1420865432453958E-28,null,2.4506491573391324E-114,null,1.9328498742660864E-30,null,null,1.0406112877297279E+98,null,null,null,0,null,null,0,null,null,null,0.57687103335792334,null,57.687103335792337,null,172.54367897046558,null,172.54367897046558,null,0.17254367897046557]
[null,1330,null,0.99082544542509199,null,-0.14724652542840583,null,null,1.164956886819426,null,null,7.7844540655861509,null,3.4627961750651423E-28,null,1.6548584286048358E-113,null,3.1237077283454697E-30,null,null,1.0406112877297279E+98,null,null,null,0,null,null,0,null,null,null,0.57713446314194317,null,57.713446314194314,null,172.62247152799893,null,172.62247152799893,null,0.17262247152799892]
[null,1340,null,0.99075678360088371,null,-0.14779904716488865,null,null,1.1655669191858642,null,null,7.7542502228981878,null,5.5579573914233823E-28,null,1.0861025888685097E-112,null,5.0123461307763311E-30,null,null,1.0406112877297279E+98,null,null,null,0,null,null,0,null,null,null,0.57739666596208894,null,57.739666596208892,null,172.70089709733463,null,172.70089709733463,null,0.17270089709733466]
[null,1350,null,0.990688126534775,null,-0.14834951107084843,null,null,1.1661745804585626,null,null,7.7243785103080409,null,8.8587143826412038E-28,null,6.9324371472130946E-112,null,7.986912813403322E-30,null,null,1.0406112877297279E+98,null,null,null,0,null,null,0,null,null,null,0.57765765516348533,null,57.76576551634853,null,172.77895967003545,null,172.77895967003545,null,0.17277895967003548]
[null,1360,null,0.99061947422643615,null,-0.14889793996919701,null,null,1.1667798965845997,null,null,7.694832826265289,null,1.4023622115785275E-27,null,4.3059881780700592E-111,null,1.2640110573556409E-29,null,null,1.0406112877297279E+98,null,null,null,0,null,null,0,null,null,null,0.57791744384630583,null,57.791744384630583,null,172.85666316439853,null,172.85666316439853,null,0.17285666316439854]
[null,1370,null,0.9905508266755374,null,-0.14944435626406707,null,null,1.167382893036409,null,null,7.665607225219734,null,2.2052030185937357E-27,null,2.6042966454317622E-110,null,1.9871090648896051E-29,null,null,1.0406112877297279E+98,null,null,null,0,null,null,0,null,null,null,0.57817604487204766,null,57.817604487204768,null,172.93401142733228,null,172.93401142733228,null,0.17293401142733228]
[null,1380,null,0.99048218388174902,null,-0.14998878195149201,null,null,1.1679835948238675,null,null,7.6366959125281415,null,3.4450760715696049E-27,null,1.5345824158167716E-109,null,3.1035190921423133E-29,null,null,1.0406112877297279E+98,null,null,null,0,null,null,0,null,null,null,0.57843347086960006,null,57.843347086960009,null,173.01100823617148,null,173.01100823617148,null,0.17301100823617149]
[null,1390,null,0.99041354584474151,null,-0.15053123862973769,null,null,1.1685820265059923,null,null,7.608093239562808,null,5.3477621895354947E-27,null,8.8148782581323864E-109,null,4.8162630180754982E-29,null,null,1.0406112877297279E+98,null,null,null,0,null,null,0,null,null,null,0.5786897342411168,null,57.86897342411168,null,173.0876573004337,null,173.0876573004337,null,0.17308765730043371]
[null,1400,null,0.99034491256418511,null,-0.15107174750930052,null,null,1.1691782122022578,null,null,7.5797936990125585,null,8.2495035641498515E-27,null,4.9386240511799574E-108,null,7.4275990772060788E-29,null,null,1.0406112877297279E+98,null,null,null,0,null,null,0,null,null,null,0.57894484716769767,null,57.894484716769767,null,173.1639622635187,null,173.1639622635187,null,0.17316396226351871]
[null,1410,null,0.99027628403975021,null,-0.15161032942258473,null,null,1.1697721756035508,null,null,7.5517919203673092,null,1.2648054888966519E-26,null,2.7001609152824458E-107,null,1.1384840102422327E-28,null,null,1.0406112877297279E+98,null,null,null,0,null,null,0,null,null,null,0.57919882161488923,null,57.919882161488921,null,173.23992670435368,null,173.23992670435368,null,0.17323992670435368]
[null,1420,null,0.99020766027110729,null,-0.15214700483327126,null,null,1.1703639399827774,null,null,7.5240826655777493,null,1.9275958528321239E-26,null,1.4414226744313024E-106,null,1.7346096450770818E-28,null,null,1.0406112877297279E+98,null,null,null,0,null,null,0,null,null,null,0.57945166933801029,null,57.945166933801026,null,173.3155541389861,null,173.3155541389861,null,0.17331555413898611]
[null,1430,null,0.99013904125792673,null,-0.15268179384539035,null,null,1.1709535282051333,null,null,7.4966608248822109,null,2.9205126138240743E-26,null,7.5167274564609232E-106,null,2.6274076795826429E-28,null,null,1.0406112877297279E+98,null,null,null,0,null,null,0,null,null,null,0.57970340188730873,null,57.970340188730873,null,173.39084802212622,null,173.39084802212622,null,0.17339084802212623]
[null,1440,null,0.99007042699987913,null,-0.153214716212109,null,null,1.1715409627380529,null,null,7.4695214127931173,null,4.3995279757856062E-26,null,3.8310135708704408E-105,null,3.9569183829491511E-28,null,null,1.0406112877297279E+98,null,null,null,0,null,null,0,null,null,null,0.57995403061295669,null,57.995403061295669,null,173.46581174864104,null,173.46581174864104,null,0.17346581174864106]
[null,1450,null,0.99000181749663474,null,-0.15374579134424432,null,null,1.1721262656608467,null,null,7.4426595642359077,null,6.5903510078014039E-26,null,1.909201874067526E-104,null,5.9257347852800783E-28,null,null,1.0406112877297279E+98,null,null,null,0,null,null,0,null,null,null,0.58020356666989081,null,58.02035666698908,null,173.54044865500219,null,173.54044865500219,null,0.17354044865500221]
[null,1460,null,0.98993321274786428,null,-0.15427503831851322,null,null,1.1727094586740425,null,null,7.4160705308335793,null,9.8178554289457658E-26,null,9.307723909228698E-104,null,8.8253711161065163E-28,null,null,1.0406112877297279E+98,null,null,null,0,null,null,0,null,null,null,0.58045202102250182,null,58.04520210225018,null,173.61476202068846,null,173.61476202068846,null,0.17361476202068846]
[null,1470,null,0.98986461275323812,null,-0.1548024758855282,null,null,1.1732905631084383,null,null,7.3897496773304496,null,1.4547190913505219E-25,null,4.4410265472188124E-103,null,1.3073088104992411E-27,null,null,1.0406112877297279E+98,null,null,null,0,null,null,0,null,null,null,0.58069940444918144,null,58.069940444918146,null,173.68875506954575,null,173.68875506954575,null,0.17368875506954579]
[null,1480,null,0.98979601751242685,null,-0.15532812247754862,null,null,1.1738695999338773,null,null,7.3636924781489617,null,2.144092613184182E-25,null,2.0747270857441883E-102,null,1.926306191803505E-27,null,null,1.0406112877297279E+98,null,null,null,0,null,null,0,null,null,null,0.5809457275467288,null,58.094572754672882,null,173.76243097110529,null,173.76243097110529,null,0.1737624309711053]
[null,1490,null,0.98972742702510108,null,-0.15585199621599707,null,null,1.1744465897677596,null,null,7.3378945140737954,null,3.1438082025574424E-25,null,9.4942513110441356E-102,null,2.8237131616288605E-27,null,null,1.0406112877297279E+98,null,null,null,0,null,null,0,null,null,null,0.5811910007346246,null,58.119100073462462,null,173.83579284186175,null,173.83579284186175,null,0.17383579284186176]
[null,1500,null,0.9896588412909314,null,-0.15637411491874853,null,null,1.175021552883295,null,null,7.3123514690576705,null,4.5862911058044181E-25,null,4.2575729738206025E-101,null,4.1182142117673718E-27,null,null,1.0406112877297279E+98,null,null,null,0,null,null,0,null,null,null,0.58143523425917631,null,58.143523425917628,null,173.90884374651333,null,173.90884374651333,null,0.17390884374651333]
[null,1510,null,0.9895902603095883,null,-0.15689449610720191,null,null,1.1755945092175102,null,null,7.2870591271436753,null,6.6573907166939403E-25,null,1.8717155397107379E-100,null,5.9763244523809883E-27,null,null,1.0406112877297279E+98,null,null,null,0,null,null,0,null,null,null,0.58167843819753928,null,58.167843819753926,null,173.98158669916427,null,173.98158669916427,null,0.17398158669916428]
[null,1520,null,0.9895216840807427,null,-0.15741315701314043,null,null,1.1761654783790172,null,null,7.2620133694990718,null,9.6166976020589035E-25,null,8.0698246948631484E-100,null,8.6305587080132081E-27,null,null,1.0406112877297279E+98,null,null,null,0,null,null,0,null,null,null,0.58192062246161869,null,58.192062246161868,null,174.05402466449209,null,174.05402466449209,null,0.1740540246644921]
[null,1530,null,0.98945311260406499,null,-0.15793011458539,null,null,1.176734479655553,null,null,7.2372101715558896,null,1.3825118912135025E-24,null,3.4135051033341686E-99,null,1.2404083522139014E-26,null,null,1.0406112877297279E+98,null,null,null,0,null,null,0,null,null,null,0.58216179680185587,null,58.21617968018559,null,174.12616055888009,null,174.12616055888009,null,0.17412616055888011]
[null,1540,null,0.98938454587922597,null,-0.15844538549628143,null,null,1.1773015320212972,null,null,7.2126456002537322,null,1.9782138231066686E-24,null,1.4171329770721288E-98,null,1.7744015930668792E-26,null,null,1.0406112877297279E+98,null,null,null,0,null,null,0,null,null,null,0.58240197081090406,null,58.240197081090407,null,174.19799725151663,null,174.19799725151663,null,0.17419799725151663]
[null,1550,null,0.98931598390589637,null,-0.15895898614792447,null,null,1.1778666541439768,null,null,7.1883158113805674,null,2.8175940844268161E-24,null,5.7763229966793738E-98,null,2.5266205155575539E-26,null,null,1.0406112877297279E+98,null,null,null,0,null,null,0,null,null,null,0.58264115392719729,null,58.264115392719731,null,174.26953756546277,null,174.26953756546277,null,0.17426953756546279]
[null,1560,null,0.98924742668374688,null,-0.15947093267829987,null,null,1.1784298643917659,null,null,7.1642170470073596,null,3.9950557696112263E-24,null,2.3124712835670491E-97,null,3.5815198903135269E-26,null,null,1.0406112877297279E+98,null,null,null,0,null,null,0,null,null,null,0.58287935543841563,null,58.287935543841563,null,174.34078427868857,null,174.34078427868857,null,0.1743407842786886]
[null,1570,null,0.98917887421244821,null,-0.15998124096717614,null,null,1.1789911808399847,null,null,7.1403456330127009,null,5.6395428462610374E-24,null,9.0956665955652314E-97,null,5.0544205721166629E-26,null,null,1.0406112877297279E+98,null,null,null,0,null,null,0,null,null,null,0.58311658448485049,null,58.311658448485048,null,174.41174012507986,null,174.41174012507986,null,0.17441174012507987]
[null,1580,null,0.9891103264916713,null,-0.16048992664185649,null,null,1.1795506212776092,null,null,7.1166979766936809,null,7.9264377467098783E-24,null,3.5161835453139453E-96,null,7.1021282100654491E-26,null,null,1.0406112877297279E+98,null,null,null,0,null,null,0,null,null,null,0.5833528500626749,null,58.33528500626749,null,174.48240779541618,null,174.48240779541618,null,0.17448240779541621]
[null,1590,null,0.98904178352108674,null,-0.16099700508276327,null,null,1.1801082032135954,null,null,7.0932705644595355,null,1.1093302371872801E-23,null,1.3363776870561764E-95,null,9.9369775783718039E-26,null,null,1.0406112877297279E+98,null,null,null,0,null,null,0,null,null,null,0.58358816102711975,null,58.358816102711977,null,174.55278993832093,null,174.55278993832093,null,0.17455278993832093]
[null,1600,null,0.98897324530036557,null,-0.16150249142886342,null,null,1.1806639438830238,null,null,7.0700599596046203,null,1.5460621659422883E-23,null,4.9951194356440802E-95,null,1.3845334113366929E-25,null,null,1.0406112877297279E+98,null,null,null,0,null,null,0,null,null,null,0.5838225260955614,null,58.38225260955614,null,174.62288916118484,null,174.62288916118484,null,0.17462288916118485]
[null,1610,null,0.98890471182917838,null,-0.16200640058294277,null,null,1.1812178602530725,null,null,7.0470628001575912,null,2.1459033459844718E-23,null,1.8367768340958392E-94,null,1.921187261951778E-25,null,null,1.0406112877297279E+98,null,null,null,0,null,null,0,null,null,null,0.58405595385052167,null,58.405595385052166,null,174.69270803106329,null,174.69270803106329,null,0.17469270803106329]
[null,1620,null,0.98883618310719634,null,-0.16250874721673211,null,null,1.1817699690288237,null,null,7.0242757968036535,null,2.9664936872199691E-23,null,6.6464892773109652E-94,null,2.6551315804671387E-25,null,null,1.0406112877297279E+98,null,null,null,0,null,null,0,null,null,null,0.58428845274258578,null,58.428845274258578,null,174.76224907554905,null,174.76224907554905,null,0.17476224907554908]
[null,1630,null,0.98876765913409004,null,-0.16300954577589177,null,null,1.1823202866589093,null,null,7.00169573087702,null,4.0846883200251194E-23,null,2.367456119460014E-93,null,3.6549769824569872E-25,null,null,1.0406112877297279E+98,null,null,null,0,null,null,0,null,null,null,0.58452003109323802,null,58.452003109323805,null,174.83151478362052,null,174.83151478362052,null,0.17483151478362052]
[null,1640,null,0.98869913990953062,null,-0.16350881048485849,null,null,1.1828688293410003,null,null,6.9793194524207633,null,5.6025793301753521E-23,null,8.303295027660036E-93,null,5.01183615835643E-25,null,null,1.0406112877297279E+98,null,null,null,0,null,null,0,null,null,null,0.58475069709762018,null,58.475069709762018,null,174.90050760646662,null,174.90050760646662,null,0.17490050760646664]
[null,1650,null,0.98863062543318891,null,-0.16400655535155961,null,null,1.1834156130271469,null,null,6.9571438783113972,null,7.6552841340560069E-23,null,2.8682701582307343E-92,null,6.8462588802213196E-25,null,null,1.0406112877297279E+98,null,null,null,0,null,null,0,null,null,null,0.5849804588272145,null,58.498045882721449,null,174.96922995828945,null,174.96922995828945,null,0.17496922995828945]
[null,1660,null,0.98856211570473596,null,-0.16450279417199876,null,null,1.1839606534289726,null,null,6.9351659904456771,null,1.0420983278384661E-22,null,9.7613504175791256E-92,null,9.3171669716603371E-25,null,null,1.0406112877297279E+98,null,null,null,0,null,null,0,null,null,null,0.58520932423245342,null,58.520932423245341,null,175.03768421708475,null,175.03768421708475,null,0.17503768421708474]
[null,1670,null,0.98849361072384256,null,-0.16499754053471768,null,null,1.1845039660227279,null,null,6.9133828339871748,null,1.4133812591669001E-22,null,3.2736811033801765E-91,null,1.2633326180461257E-24,null,null,1.0406112877297279E+98,null,null,null,0,null,null,0,null,null,null,0.58543730114525905,null,58.543730114525907,null,175.10587272540147,null,175.10587272540147,null,0.17510587272540148]
[null,1680,null,0.98842511049017989,null,-0.16549080782513756,null,null,1.185045566054209,null,null,6.8917915156703131,null,1.910036514548687E-22,null,1.0822137403770194E-90,null,1.7068025251610163E-24,null,null,1.0406112877297279E+98,null,null,null,0,null,null,0,null,null,null,0.58566439728151465,null,58.566439728151465,null,175.17379779108111,null,175.17379779108111,null,0.17517379779108114]
[null,1690,null,0.98835661500341898,null,-0.16598260922978475,null,null,1.1855854685435436,null,null,6.8703892021596547,null,2.5720743402659074E-22,null,3.5273683789501582E-90,null,2.2977796254512223E-24,null,null,1.0406112877297279E+98,null,null,null,0,null,null,0,null,null,null,0.58589062024346961,null,58.589062024346958,null,175.24146168797691,null,175.24146168797691,null,0.17524146168797694]
[null,1700,null,0.98828812426323076,null,-0.16647295774040372,null,null,1.1861236882898507,null,null,6.8491731184623248,null,3.4515328374419757E-22,null,1.1338562053263702E-89,null,3.0826210665489652E-24,null,null,1.0406112877297279E+98,null,null,null,0,null,null,0,null,null,null,0.58611597752208078,null,58.611597752208077,null,175.30886665665423,null,175.30886665665423,null,0.17530886665665424]
[null,1710,null,0.98821963826928649,null,-0.16696186615796152,null,null,1.1866602398757768,null,null,6.8281405463915554,null,4.6158709045110257E-22,null,3.5953426879434543E-89,null,4.1214030304866148E-24,null,null,1.0406112877297279E+98,null,null,null,0,null,null,0,null,null,null,0.58634047649929244,null,58.634047649929244,null,175.37601490507248,null,175.37601490507248,null,0.17537601490507249]
[null,1720,null,0.988151157021257,null,-0.16744934709654699,null,null,1.1871951376719134,null,null,6.8072888230793929,null,6.1522551760146505E-22,null,1.1248666590782013E-88,null,5.4917289793138481E-24,null,null,1.0406112877297279E+98,null,null,null,0,null,null,0,null,null,null,0.58656412445025585,null,58.656412445025587,null,175.44290860924897,null,175.44290860924897,null,0.17544290860924899]
[null,1730,null,0.98808268051881365,null,-0.16793541298716802,null,null,1.1877283958410989,null,null,6.7866153395367608,null,8.1729597511182236E-22,null,3.4732908352839374E-88,null,7.2935248110951376E-24,null,null,1.0406112877297279E+98,null,null,null,0,null,null,0,null,null,null,0.58678692854549175,null,58.678692854549176,null,175.50954991390577,null,175.50954991390577,null,0.1755095499139058]
[null,1740,null,0.98801420876162749,null,-0.16842007608145027,null,null,1.1882600283426084,null,null,6.7661175392590511,null,1.0822146896269332E-21,null,1.0586665685424704E-87,null,9.6550583327640402E-24,null,null,1.0406112877297279E+98,null,null,null,0,null,null,0,null,null,null,0.58700889585299565,null,58.700889585299564,null,175.57594093309936,null,175.57594093309936,null,0.17557594093309936]
[null,1750,null,0.98794574174936978,null,-0.16890334845524024,null,null,1.1887900489362366,null,null,6.745792916875617,null,1.4284356490548271E-21,null,3.1860422207267793E-87,null,1.2740473090165809E-23,null,null,1.0406112877297279E+98,null,null,null,0,null,null,0,null,null,null,0.58723003334028989,null,58.723003334028988,null,175.64208375083442,null,175.64208375083442,null,0.17564208375083445]
[null,1760,null,0.98787727948171145,null,-0.16938524201211605,null,null,1.1893184711862752,null,null,6.7256390168414724,null,1.8795103659993653E-21,null,9.4691780354014539E-87,null,1.6759189885788053E-23,null,null,1.0406112877297279E+98,null,null,null,0,null,null,0,null,null,null,0.58745034787642292,null,58.74503478764229,null,175.70798042166186,null,175.70798042166186,null,0.17570798042166186]
[null,1770,null,0.98780882195832398,null,-0.16986576848680826,null,null,1.1898453084653884,null,null,6.7056534321697168,null,2.465407003382906E-21,null,2.7799276019757471E-86,null,2.1977605207362514E-23,null,null,1.0406112877297279E+98,null,null,null,0,null,null,0,null,null,null,0.58766984623391694,null,58.766984623391693,null,175.77363297126126,null,175.77363297126126,null,0.17577363297126128]
[null,1780,null,0.98774036917887842,null,-0.17034493944853413,null,null,1.1903705739583912,null,null,6.6858338032031401,null,3.2241476926517522E-21,null,8.0631565315649553E-86,null,2.8733606547104455E-23,null,null,1.0406112877297279E+98,null,null,null,0,null,null,0,null,null,null,0.58788853509066741,null,58.78885350906674,null,175.83904339700916,null,175.83904339700916,null,0.17583904339700918]
[null,1790,null,0.98767192114304614,null,-0.1708227663042475,null,null,1.1908942806659306,null,null,6.666177816423617,null,4.2038351490949332E-21,null,2.3110803311444616E-85,null,3.7454532832284962E-23,null,null,1.0406112877297279E+98,null,null,null,0,null,null,0,null,null,null,0.58810642103179289,null,58.810642103179291,null,175.90421366853224,null,175.90421366853224,null,0.17590421366853226]
[null,1800,null,0.98760347785049851,null,-0.17129926030180742,null,null,1.1914164414080781,null,null,6.6466832032979086,null,5.4651542953075335E-21,null,6.5471053164168211E-85,null,4.8679336942151943E-23,null,null,1.0406112877297279E+98,null,null,null,0,null,null,0,null,null,null,0.58832351055144128,null,58.83235105514413,null,175.96914572824761,null,175.96914572824761,null,0.17596914572824762]
[null,1810,null,0.98753503930090658,null,-0.17177443253306701,null,null,1.191937068827827,null,null,6.6273477391585764,null,7.0844519410109123E-21,null,1.8335469605542939E-84,null,6.308586004566636E-23,null,null,1.0406112877297279E+98,null,null,null,0,null,null,0,null,null,null,0.58853981005454781,null,58.853981005454784,null,176.03384149188864,null,176.03384149188864,null,0.17603384149188867]
[null,1820,null,0.98746660549394183,null,-0.17224829393688634,null,null,1.1924561753945087,null,null,6.6081692421187261,null,9.1575180936178272E-21,null,5.077213371274492E-84,null,8.1524308274859617E-23,null,null,1.0406112877297279E+98,null,null,null,0,null,null,0,null,null,null,0.58875532585855195,null,58.875532585855197,null,176.09830284901849,null,176.09830284901849,null,0.17609830284901851]
[null,1830,null,0.98739817642927552,null,-0.17272085530207065,null,null,1.1929737734071209,null,null,6.5891455720194312,null,1.1804216715102821E-20,null,1.3903684514595563E-83,null,1.050582356561231E-22,null,null,1.0406112877297279E+98,null,null,null,0,null,null,0,null,null,null,0.58897006419507147,null,58.89700641950715,null,176.16253166353081,null,176.16253166353081,null,0.17616253166353082]
[null,1840,null,0.98732975210657914,null,-0.17319212727023603,null,null,1.1934898749975753,null,null,6.5702746294085976,null,1.5174142299218264E-20,null,3.7660337078594146E-83,null,1.3501458852780487E-22,null,null,1.0406112877297279E+98,null,null,null,0,null,null,0,null,null,null,0.58918403121153406,null,58.918403121153403,null,176.22652977413776,null,176.22652977413776,null,0.17622652977413777]
[null,1850,null,0.98726133252552406,null,-0.1736621203386059,null,null,1.1940044921338668,null,null,6.551554354550265,null,1.9453512206763043E-20,null,1.0091722614542428E-82,null,1.7304466189473822E-22,null,null,1.0406112877297279E+98,null,null,null,0,null,null,0,null,null,null,0.58939723297277147,null,58.939723297277148,null,176.29029899484686,null,176.29029899484686,null,0.17629029899484688]
[null,1860,null,0.98719291768578155,null,-0.17413084486273891,null,null,1.1945176366231645,null,null,6.5329827264631888,null,2.4873544049495774E-20,null,2.6757685845676886E-82,null,2.2119816416265489E-22,null,null,1.0406112877297279E+98,null,null,null,0,null,null,0,null,null,null,0.58960967546257292,null,58.960967546257294,null,176.35384111542555,null,176.35384111542555,null,0.17635384111542557]
[null,1870,null,0.9871245075870233,null,-0.17459831105919116,null,null,1.1950293201148294,null,null,6.5145577619877431,null,3.1720613446584573E-20,null,7.0211405789387895E-82,null,2.8201299124558648E-22,null,null,1.0406112877297279E+98,null,null,null,0,null,null,0,null,null,null,0.58982136458520307,null,58.982136458520309,null,176.41715790185532,null,176.41715790185532,null,0.17641715790185533]
[null,1880,null,0.98705610222892048,null,-0.17506452900811426,null,null,1.1955395541033578,null,null,6.4962775148801315,null,4.0348541202329147E-20,null,1.8235380077264238E-81,null,3.5862378297673737E-22,null,null,1.0406112877297279E+98,null,null,null,0,null,null,0,null,null,null,0.59003230616688096,null,59.003230616688093,null,176.48025109677394,null,176.48025109677394,null,0.17648025109677395]
[null,1890,null,0.9869877016111448,null,-0.17552950865579181,null,null,1.1960483499312566,null,null,6.478140074932992,null,5.1193421514515977E-20,null,4.6885725120310519E-81,null,4.5489288406504783E-22,null,null,1.0406112877297279E+98,null,null,null,0,null,null,0,null,null,null,0.5902425059572266,null,59.024250595722663,null,176.54312241990823,null,176.54312241990823,null,0.17654312241990824]
[null,1900,null,0.98691930573336772,null,-0.17599325981711489,null,null,1.1965557187918492,null,null,6.4601435671214666,null,6.4791475511564246E-20,null,1.1935875157304838E-80,null,5.7556796979908228E-22,null,null,1.0406112877297279E+98,null,null,null,0,null,null,0,null,null,null,0.59045196963067126,null,59.045196963067127,null,176.60577356849586,null,176.60577356849586,null,0.17660577356849586]
[null,1910,null,0.98685091459526075,null,-0.17645579217799939,null,null,1.1970616717320144,null,null,6.4422861507738869,null,8.1800498689855645E-20,null,3.0090084725105329E-80,null,7.264713360023262E-22,null,null,1.0406112877297279E+98,null,null,null,0,null,null,0,null,null,null,0.59066070278783511,null,59.066070278783513,null,176.66820621769742,null,176.66820621769742,null,0.17666820621769741]
[null,1920,null,0.98678252819649537,null,-0.17691711529774648,null,null,1.1975662196548622,null,null,6.4245660187662326,null,1.0302556831796186E-19,null,7.5130167112058247E-80,null,9.1472670765823924E-22,null,null,1.0406112877297279E+98,null,null,null,0,null,null,0,null,null,null,0.59086871095687221,null,59.086871095687222,null,176.73042202099865,null,176.73042202099865,null,0.17673042202099865]
[null,1930,null,0.98671414653674316,null,{"$f":"($M$18-$M$14-($I$36*B309))/POWER(4*$S$36*B309,0.5)","v":-0.1773772386113476},null,null,{"$f":"IF(F309>0,ERFC(IF(F309<27,F309,27)),1+ERF(IF(-F309<27,-F309,27)))","v":1.1980693733223466},null,null,{"$f":"($M$18-(B309*$I$36))/POWER(4*$S$36*B309,0.5)","v":6.4069813967395657},null,{"$f":"IF(L309>0,ERFC(IF(L309<27,L309,27)),1+ERF(IF(-L309<27,-L309,27)))","v":1.2944978942964181E-19},null,{"$f":"IF(($M$18+$M$14+$I$36*B309)/POWER(4*$S$36*B309,0.5)>27,ERFC(27),ERFC(($M$18+$M$14+$I$36*B309)/POWER(4*$S$36*B309,0.5)))","v":1.8581981180682989E-79},null,{"$f":"IF(($M$18+$I$36*B309)/(POWER(4*$S$36*B309,0.5))>27,ERFC(27),ERFC(($M$18+$I$36*B309)/(POWER(4*$S$36*B309,0.5))))","v":1.1490304071518783E-21},null,null,{"$f":"(2+$I$36/$C$42)*EXP(IF(($C$42*($C$42+$I$36)*B309+($C$42+$I$36)*$M$18)/$S$36>225,225,($C$42*($C$42+$I$36)*B309+($C$42+$I$36)*$M$18)/$S$36))","v":1.0406112877297279E+98},null,null,null,{"$f":"IF(($M$18+((2*$C$42+$I$36)*B309))/POWER(4*$S$36*B309,0.5)>27,ERFC(27),ERFC(($M$18+((2*$C$42+$I$36)*B309))/POWER(4*$S$36*B309,0.5)))","v":0},null,null,{"$f":"IF(($M$18+$M$14+((2*$C$42+$I$36)*B309))/POWER(4*$S$36*B309,0.5)>27,ERFC(27),ERFC(($M$18+$M$14+((2*$C$42+$I$36)*B309))/POWER(4*$S$36*B309,0.5)))","v":0},null,null,null,0.59107599959478496,null,59.107599959478499,null,176.79242261060364,null,176.79242261060364,null,0.17679242261060366]
[null,{"$f":"B309+$M$20","v":1940},null,{"$f":"EXP(-0.693/$M$6*B310)","v":0.98664576961567585},null,-0.17783617143173588,null,null,1.1985711433578172,null,null,6.3895305423396609,null,1.6227098770030812E-19,null,4.5532340097335422E-79,null,1.4399748591260242E-21,null,null,1.0406112877297279E+98,null,null,null,0,null,null,0,null,null,null,{"$f":"0.5*D310*((I310-N310)+($Q$44)*(P310-R310)+U310*(Y310-($Q$84*AB310)))","v":0.5912825740887071},null,{"$f":"$M$4*AF310","v":59.128257408870709},null,{"$f":"AF310*$M$25","v":176.85420959781865},null,{"$f":"AF310*$M$27","v":176.85420959781865},null,{"$f":"AF310*$M$28","v":0.17685420959781864}]
[null,1950,null,0.98657739743296502,null,-0.17829392295198557,null,null,1.1990715402485121,null,null,6.3722117444781086,null,2.0294540659217058E-19,null,1.1055044469885437E-78,null,1.8004337145275126E-21,null,null,1.0406112877297279E+98,null,null,null,0,null,null,0,null,null,null,0.59148843975715693,null,59.148843975715693,null,176.91578457342675,null,176.91578457342675,null,0.17691578457342677]
[null,1960,null,0.98650902998828227,null,-0.1787505022474605,null,null,1.1995705743479936,null,null,6.3550233226141613,null,2.5323963722665858E-19,null,2.6599568237498147E-78,null,2.2460193738220942E-21,null,null,1.0406112877297279E+98,null,null,null,0,null,null,0,null,null,null,0.59169360185126296,null,59.169360185126294,null,176.97714910805468,null,176.97714910805468,null,0.1769771491080547]
[null,1970,null,0.9864406672812992,null,-0.17920591827791346,null,null,1.2000682558785274,null,null,6.3379636260566485,null,3.1529220535444808E-19,null,6.3433987997080731E-78,null,2.7956254033860608E-21,null,null,1.0406112877297279E+98,null,null,null,0,null,null,0,null,null,null,0.5918980655559597,null,59.189806555595972,null,177.03830475253028,null,177.03830475253028,null,0.1770383047525303]
[null,1980,null,0.98637230931168762,null,-0.17966017988953761,null,null,1.2005645949334085,null,null,6.3210310332852915,null,3.9168646371617429E-19,null,1.4995513311763654E-77,null,3.4720682972880115E-21,null,null,1.0406112877297279E+98,null,null,null,0,null,null,0,null,null,null,0.59210183599115851,null,59.210183599115851,null,177.09925303823283,null,177.09925303823283,null,0.17709925303823285]
[null,1990,null,0.98630395607911914,null,-0.18011329581697136,null,null,1.2010596014792339,null,null,6.3042239512907923,null,4.8553669353846767E-19,null,3.514389810089185E-77,null,4.3028452695717784E-21,null,null,1.0406112877297279E+98,null,null,null,0,null,null,0,null,null,null,0.59230491821288933,null,59.230491821288936,null,177.15999547743445,null,177.15999547743445,null,0.17715999547743447]
[null,2000,null,0.98623560758326567,null,-0.1805652746852579,null,null,1.2015532853581234,null,null,6.287540814933088,null,6.0058960978434721E-19,null,8.1666516691523413E-77,null,5.3210273035095444E-21,null,null,1.0406112877297279E+98,null,null,null,0,null,null,0,null,null,null,0.59250731721441896,null,59.250731721441895,null,177.22053356363475,null,177.22053356363475,null,0.17722053356363476]
[null,2010,null,0.98616726382379871,null,-0.1810161250117609,null,null,1.2020456562898922,null,null,6.2709800863171736,null,7.4134379537601832E-19,null,1.8819095861467541E-76,null,6.5663095713880427E-21,null,null,1.0406112877297279E+98,null,null,null,0,null,null,0,null,null,null,0.59270903792734275,null,59.270903792734273,null,177.28086877188713,null,177.28086877188713,null,0.17728086877188715]

{"sheet":"OutputJury1","index":8,"n_rows":93,"n_cols":14,"rows_kept":93,"cut":false,"hidden":true,"merged":[]}
["2008-11-01"]
[]
[null,null,null,"Outputs from Soil Contamination Versus Time, IntercalcsJury1"]
[]
[null,null,null,null,null,{"$f":"IF('Alt-GPL Calc for VOCs'!$I$13>IntercalsJury1!$M$30*1000,\"Warning: Input soil concentration exceeds maximum allowed\",\" \")","v":" "}]
[]
[]
[]
[]
[]
[]
[]
[]
[]
[]
[]
[]
[]
[]
[]
[]
[]
[]
[]
[]
[]
[null,null,null,null,null,{"$f":"IF('Alt-GPL Calc for VOCs'!$I$13>IntercalsJury1!$M$30*1000,\"Warning: Input soil concentration exceeds maximum allowed\",\" \")","v":" "}]
[]
[]
[]
[]
[]
[]
[]
[]
[]
[]
[]
[]
[]
[]
[]
[]
[]
[]
[]
[]
[null,null,null,null,null,{"$f":"IF('Alt-GPL Calc for VOCs'!$I$13>IntercalsJury1!$M$30*1000,\"Warning: Input soil concentration exceeds maximum allowed\",\" \")","v":" "}]
[]
[]
[]
[]
[]
[]
[]
[]
[]
[]
[]
[]
[]
[]
[null,null,null,null,null,null,null,null,null,null,null,"       "]
[]
[]
[]
[]
[]
[null,null,null,null,null,{"$f":"IF('Alt-GPL Calc for VOCs'!$I$13>IntercalsJury1!$M$30*1000,\"Warning: Input soil concentration exceeds maximum allowed\",\" \")","v":" "}]
[]
[]
[]
[]
[]
[]
[]
[]
[]
[]
[]
[]
[]
[]
[]
[]
[]
[]
[]
[]
[null,null,null,null,null,{"$f":"IF('Alt-GPL Calc for VOCs'!$I$13>IntercalsJury1!$M$30*1000,\"Warning: Input soil concentration exceeds maximum allowed\",\" \")","v":" "}]
[]
[]
[null,null,null,null,null,null,null,null,null,null,null,null,null,"                                                                                                                                                                                                                                                                                                                                                                                                                                                                                                                                                                                                                                                                                                                                                                                                                                                                                                                                                                                                                                                                                                                                               "]

{"sheet":"GPL","index":9,"n_rows":245,"n_cols":7,"rows_kept":245,"cut":false,"hidden":true,"merged":[]}
["2008-06-01"]
[null,null,"Saturated Zone Mixing Cell Model",null,null,null,"(calculates soil concentration  protective of groundwater quality)"]
[]
[]
[]
[]
[null,"Sc = Distance from edge of release to compliance point (m)",null,null,null,{"$f":"'Alt-GPL Calc for VOCs'!I27","v":30.5}]
[]
[null,"s = Screen interval (m)",null,null,null,{"$f":"'Alt-GPL Calc for VOCs'!I29","v":8.1999999999999993}]
[]
[null,"WQS = Water quality standard (ug/l)",null,null,null,{"$f":"'Alt-GPL Calc for VOCs'!I10","v":1}]
[]
[null,"T1/2 GW = Saturated zone 1/2 life (d)",null,null,null,{"$f":"'Alt-GPL Calc for VOCs'!I12","v":100000}]
[]
[null,"v = Groundwater velocity [v=Ki/n] (cm/d)",null,null,null,{"$f":"'Alt-GPL Calc for VOCs'!I30","v":10}]
[]
[null,"Si = Infiltration rate (cm/d)",null,null,null,{"$f":"'Alt-GPL Calc for VOCs'!I24","v":7.0000000000000001E-3}]
[null," (under source zone)"]
[]
[null,"Ai= Infiltration rate (cm/d)",null,null,null,{"$f":"'Alt-GPL Calc for VOCs'!I31","v":7.0000000000000001E-3}]
[null," (outside source zone)"]
[]
[null,"Sl = Source width (m)",null,null,null,{"$f":"'Alt-GPL Calc for VOCs'!I28","v":10}]
[]
[null,"Φ = total porosity (vol/vol)",null,null,null,{"$f":"'Alt-GPL Calc for VOCs'!I16","v":0.5}]
[]
[null,"θ = water content (vol/vol)",null,null,null,{"$f":"'Alt-GPL Calc for VOCs'!I18","v":0.45}]
[]
[null,"foc A = Organic carbon in aquifer (mass/mass)",null,null,null,{"$f":"'Alt-GPL Calc for VOCs'!I20","v":1E-3}]
[]
[null,"koc = Soil distribution coefficient (L/kg)",null,null,null,{"$f":"'Alt-GPL Calc for VOCs'!$I$9","v":1}]
[]
[null,"Pb = Dry bulk density (g/cm3)",null,null,null,{"$f":"'Alt-GPL Calc for VOCs'!I17","v":1.5}]
[]
[null,"R = Retardation factor",null,"1+ (Pb)(Koc)(foc A)/ Φ",null,{"$f":"1+(F33*F31*F29)/F25","v":1.0029999999999999}]
[]
[null,"I.  Calcuate water travel time to compliance point"]
[]
[null,null,"t = (Sc + Sl)/ v"]
[]
[null,null,"t (days) =",{"$f":"($F$7+$F$23)/($F$15/100)","v":405}]
[]
[null,"II.  Calculate concentration reduction due to degradation in the saturated zone"]
[]
[null,null,"A. Calculate saturated zone degradation time"]
[]
[null,null,null,"t = R*Sc/ v"]
[]
[null,null,null,{"$f":"$F$35*(F7+ F23)/(F15/100)","v":406.21499999999997},"days"]
[]
[]
[null,null," B.  Calculate the dilution factor from peak vadose zone concentration to saturated "]
[null,null,"concentration at compliance point but before well screen dilution"]
[]
[null,null,null,"daf =(Si)(Sl)/((Ai)(Sc) + (Si)(Sl))"]
[]
[null,null,null,"daf =",null,{"$f":"$F$23*$F$17/($F$23*$F$17+($F$7*$F$20))","v":0.24691358024691362}]
[]
[]
[null,null,"C.  Calculate the degraded peak liquid phase concentration at compliance point but before well screen adjustment"]
[]
[null,null,null,{"$f":"MAX(IntercalsJury1!AJ117:AJ317)*(EXP(-0.693/$F$13*$D$49))*$F$57","v":43.650003088512399},"ug/L"]
[null,"max vadose zone ",null,{"$f":"MAX(IntercalsJury1!AJ117:AJ317)","v":177.28086877188713},"ug/L"]
[]
[null,null,"D.  Calculate peak concentration adusted for well screen"]
[]
[null,null,null,"1) Calculate mixing zone depth at compliance point"]
[]
[null,null,null,null,"t =( Sc + Sl)/ v"]
[]
[null,null,null,null,{"$f":"(F7+F23)*100/F15","v":405},null,"unit days"]
[]
[null,null,null,"2) mixing depth = (infiltration rate)(t)/porosity  "]
[]
[null,null,null,"d (cm) =",{"$f":"$F$17*$E$71/F25","v":5.67}]
[]
[null,null,null,"3) daf well screen =  well screen/d"]
[]
[null,null,null,null,{"$f":"IF($F$9*100/$E$75>1,$F$9*100/$E$75,1)","v":144.62081128747795},"(length/length)"]
[]
[]
[null,null,"E.  Calculate GPL"]
[]
[null,null,null,"1) Calculate peak groundwater concentration after well screen dilution"]
[]
[null,null,null,null,{"$f":"$D$62/$E$79","v":0.30182380184373819},"ug/L"]
[]
[null,null,null,"2) Adjust initial soil contaminant concentration and calculate GPL"]
[]
[null,null,null,null,{"$f":"(IntercalsJury1!$M$5*$F$11/$E$86)/($F$33+$F$27)/1000","v":0.25486087065758301},"mg/kg"]
[]
[null,null,null,"3) Compare to soil saturation concentration"]
[]
[null,null,null,"soil saturation (mg/kg) =",null,{"$f":"IntercalsJury1!M30","v":0.33433333333333337}]
[]
[null,null,null,{"$f":"IF(E90>F94,F94,E90)","v":0.25486087065758301},"mg/kg"]
[null,null,null,{"$f":"IF(E90>F94,\"GPL based upon solubility threshold\",\"\")","v":""}]
[]
[]
[]
[null,null,null,{"$f":"IF($E$99>IntercalsJury1!$M$30,\"Warning:  Soil concentration exceeds saturation level\",\" \")","v":" "}]
[]
[]
[]
[]
[]
[]
[]
[]
[]
[]
[]
[]
[]
[]
[]
[]
[]
[]
[]
[]
[]
[]
[]
[]
[]
[]
[]
[]
[]
[]
[]
[]
[]
[]
[]
[]
[]
[]
[]
[]
[]
[]
[]
[]
[]
[]
[]
[]
[]
[]
[]
[]
[]
[]
[]
[]
[]
[]
[]
[]
[]
[]
[]
[]
[]
[]
[]
[]
[]
[]
[]
[]
[]
[]
[]
[]
[]
[]
[]
[]
[]
[]
[]
[]
[]
[]
[]
[]
[]
[]
[]
[]
[]
[]
[]
[]
[]
[]
[]
[]
[]
[]
[]
[]
[]
[]
[]
[]
[]
[]
[]
[]
[]
[]
[]
[]
[]
[]
[]
[]
[]
[]
[]
[]
[]
[]
[]
[]
[]
[]
[]
[]
[]
[]
[]
[]
[]
[]
[]
[]
[]
[]
[]
[null,"IV.  Calculate "]

{"sheet":"IntercalcsJury2","index":10,"n_rows":263,"n_cols":43,"rows_kept":263,"cut":false,"hidden":true,"merged":[]}
["2008-01-28",null,"Solution of Jury Equation",null,null,"This spreadsheet estimates  C/Co at depth given a specific time."]
[]
[]
[null,"Ct = total soil contamination (ug/kg)",null,null,null,null,null,null,null,null,null,null,{"$f":"'Alt-GPL Calc for VOCs'!I13","v":100}]
[null,"Co (ug/cm3) = (Ct)(Pbw)",null,null,null,null,null,null,null,null,null,null,{"$f":"$M$4*$M$9","v":150}]
[null,"T1/2 (d)",null,null,null,null,null,null,null,null,null,null,{"$f":"'Alt-GPL Calc for VOCs'!I11","v":100000}]
[null,"Kh (dimensionless)",null,null,null,null,null,null,null,null,null,null,{"$f":"'Alt-GPL Calc for VOCs'!$I$7","v":1}]
[null,"Φ(total porosity)",null,null,null,null,null,null,null,null,null,null,{"$f":"'Alt-GPL Calc for VOCs'!I16","v":0.5}]
[null,"Pb dry g/cm3 ",null,null,null,null,null,null,null,null,null,null,{"$f":"'Alt-GPL Calc for VOCs'!I17","v":1.5}]
[null,"foc",null,null,null,null,null,null,null,null,null,null,{"$f":"'Alt-GPL Calc for VOCs'!I19","v":1E-3}]
[null,"Dga (cm2/d)",null,null,null,null,null,null,null,null,null,null,{"$f":"'Alt-GPL Calc for VOCs'!I21","v":7000},"(default)"]
[null,"D1w(cm2/d)",null,null,null,null,null,null,null,null,null,null,{"$f":"'Alt-GPL Calc for VOCs'!I22","v":0.7},"(default)","         "]
[null,"L (cm)(depth of incorporation)",null,null,null,null,null,null,null,null,null,null,{"$f":"'Alt-GPL Calc for VOCs'!I25","v":1000}," "]
[null,"θ (vol/vol)= water content",null,null,null,null,null,null,null,null,null,null,{"$f":"'Alt-GPL Calc for VOCs'!I18","v":0.45}]
[null,"Jw (water flux- cm/d)",null,null,null,null,null,null,null,null,null,null,{"$f":"'Alt-GPL Calc for VOCs'!I24","v":7.0000000000000001E-3}]
[null,"Koc (cm3/g)",null,null,null,null,null,null,null,null,null,null,{"$f":"'Alt-GPL Calc for VOCs'!$I$9","v":1}]
[null,"z (total vadose zone depth, cm)",null,null,null,null,null,null,null,null,null,null,{"$f":"'Alt-GPL Calc for VOCs'!I34","v":3000}]
[null,"a(air filled porosity)",null,null,null,null,null,null,null,null,null,null,{"$f":"$M$8-$M$14","v":4.9999999999999989E-2}]
[null,"t (days) (calculation test)",null,null,null,null,null,null,null,null,null,null,{"$f":"'Alt-GPL Calc for VOCs'!I33","v":365}]
[null,"d(diffusion layer thickness,cm)",null,null,null,null,null,null,null,null,null,null,0.5,"(default)"]
[]
[]
[]
[null,"Rl (liquid phase coeffcient ) = (Pb)(foc)(Koc)+Φ+aKh",null,null,null,null,null,null,null,null,null,null,{"$f":"($M$16*$M$10*$M$9)+($M$14+$M$18*$M$7)","v":0.50149999999999995}]
[null,"Maximum liquid phase concentration (ug/l)",null,null,null,null,null,null,null,null,null,null,{"$f":"$M$5/$M$24","v":299.10269192422737}]
[null,"Maximum gas phase Concentraton (ug/l) = Kh*Max. liquid phase",null,null,null,null,null,null,null,null,null,null,{"$f":"$M$25*$M$7","v":299.10269192422737}]
[null,"Maximum sorbed phase soil concentration (ug/kg) = (Cl)(Foc)(Koc)",null,null,null,null,null,null,null,null,null,null,{"$f":"$M$25*$M$10*$M$16","v":0.29910269192422739}]
[null,null,"A",null,null,null,null,null,null,null,null,null,null,null,"B"]
[null,null,null,null,null,null,null,"Ve=Jw/((Pb)(Foc)(Koc)+θ+aKh)"]
[null,null,null,null,null,null,null,null,null,null,null,null,null,null,null,null,null,"De=((a3.33)(Dga)(Kh)+(θ3.33)(D1w))/Φ2/((Pb)(Foc)(Koc)+θ+aKh)"]
[null,"(Pb)(Foc)(Koc)",null,null,null,null,null,null,{"$f":"$M$9*$M$10*$M$16","v":1.5E-3}]
[null,"(Pb)(Foc)(Koc)+θ+aKh",null,null,null,null,null,null,{"$f":"$I$31+$M$14+$M$18*$M$7","v":0.50150000000000006},null,null,null,null,null,"(a3.33)(Dga)(Kh)+(θ3.33)(D1w))/Φ2",null,null,null,null,{"$f":"((POWER($M$18,3.33)*$M$11*$M$7+POWER($M$14,3.33)*$M$12))/POWER($M$8,2)","v":1.49839626292817}]
[null,"Ve =",null,null,null,null,null,null,{"$f":"$M$15/$I$32","v":1.3958125623130606E-2},null,null,null,null,null,null,null,null,"De=",null,{"$f":"$T$32/$I$32","v":2.9878290387401192}]
[]
[]
[null,null,"C",null,null,null,null,null,null,null,null,null,null,null,"D"]
[null,"He=(Kh)(Dga)/(d((Pb)(Foc)(Koc)+θ+aKh))",null,null,null,null,null,null,null,null,null,null,null,"(1+Ve/He)(exp(Ve)(z)/De)"]
[]
[null,null,{"$f":"$M$11*$M$7/($M$20*$I$32)","v":27916.251246261214},null,null,null,null,null,null,null,null,null,null,"1+(Ve/He) =",null,null,null,{"$f":"1+($I$33/$C$39)","v":1.0000005000000001}]
[null,null,null,null,null,null,null,null,null,null,null,null,null,"(Ve)(z)/De =",null,null,null,{"$f":"($I$33*$M$17)/$T$33","v":14.014984233183913}]
[null,null,null,null,null,null,null,null,null,null,null,null,null,"1+Ve/He)(exp((Ve)(z)/De =",null,null,null,{"$f":"R39*EXP(R40)","v":1220760.6831472458}]
[]
[]
[null,null,"E",null,null,null,null,null,null,null,null,null,null,null,null,null,"F"]
[null,null,null,null,null,null,null,"erfc(z-L-(Ve)(t)/(4De)(t).5)",null,null,null,null,null,null,null,null,"z-(Ve)(t)/4De)(t).5)"]
[]
[null,"z-L-(Ve)(t)",null,null,null,null,null,null,{"$f":"($M$17-$M$13-($I$33*$M$19))","v":1994.9052841475573},null,null,null,null,"z-(Ve)(t)",null,null,null,{"$f":"($M$17-$M$19*$I$33)","v":2994.9052841475573}]
[null,"4De)(t).5)",null,null,null,null,null,null,{"$f":"POWER(4*$T$33*$M$19,0.5)","v":66.04718310844585},null,null,null,null,"z-(Ve)(t)/4De)(t).5 =",null,null,null,{"$f":"($M$17-($M$19*$I$33))/POWER(4*$T$33*$M$19,0.5)","v":45.344935895753302}]
[null,"z-L-(Ve)(t)/4De)(t).5)=",null,null,null,null,null,null,{"$f":"($M$17-$M$13-($I$33*$M$19))/POWER(4*$T$33*$M$19,0.5)","v":30.204244757449114},null,null,null,null,"erfc(z-(Ve)(t)/4De)(t).5))",null,null,null,{"$f":"IF($R$48>0,ERFC(IF($R$48<27,$R$48,27)),1+ERF(IF(-$R$48<27,-$R$48,27)))","v":0}]
[null,"erfc(z-L-(Ve)(t)/(4De)(t).5)=",null,null,null,null,null,null,{"$f":"IF($I$49>0,ERFC(IF($I$49<27,$I$49,27)),1+ERF(IF(-$I$49<27,-$I$4%,27)))","v":0},null,null,null,null,null,null,null,null,null,{"$f":"IF(($M$17-$M$19*$I$33)/POWER(4*$T$33*$M$19,0.5)>27,ERFC(27),6)","v":0}]
[]
[]
[null,null,"G",null,null,null,null,null,null,null,null,null,null,null,null,null,"H"]
[]
[null,null,null,null,null,null,null,"(1+Ve/He)(exp((Ve)(z)/De",null,null,null,null,null,null,null,null,"erfc(z+L+(Ve)(t)/(4De)(t).5))"]
[null,null,null,null,null,null,null,"(D)"]
[null,"1+(Ve/He) =",null,null,null,null,null,null,{"$f":"1+($I$33/$C$39)","v":1.0000005000000001},null,null,null,null,"z+L+(Ve)(t) =",null,null,null,{"$f":"$M$17+$M$13+($I$33*$M$19)","v":4005.0947158524427}]
[null,"(Ve)(z)/De =",null,null,null,null,null,null,{"$f":"($I$33*$M$17)/$T$33","v":14.014984233183913},null,null,null,null,"z+L+(Ve)(t)/(4De)(t).5) =",null,null,null,{"$f":"($M$17+$M$13+$I$33*$M$19)/POWER(4*$T$33*$M$19,0.5)","v":60.639902072376003}]
[null,"1+Ve/He)(exp((Ve)(z)/De =",null,null,null,null,null,null,{"$f":"(1+($I$33/$C$39))*EXP(($I$33*$M$17)/$T$33)","v":1220760.6831472458},null,null,null,null,"erfc(z+L+(Ve)(t)/(4De)(t).5) =",null,null,null,{"$f":"IF($R$58>27,ERFC(27),ERFC($R$58))","v":0}]
[]
[null,null,"I",null,null,null,null,null,null,null,null,null,null,null,null,null,"J"]
[]
[null,null,null,null,null,null,null,"erfc(z+(Ve)(t)/(4De)(t).5)",null,null,null,null,null,null,null,null,"2+(Ve)/(He)exp((He(He+Ve)(t)+(He+Ve)z)De"]
[]
[null,"z+(Ve)(t) =",null,null,null,null,null,null,{"$f":"$M$17+($I$33*$M$19)","v":3005.0947158524427},null,null,null,null,"2+(Ve)/(He)",null,null,null,{"$f":"2+$I$33/$C$39","v":2.0000005000000001}]
[null,"z+(Ve)(t)/((4)(De)(t))1/2 =",null,null,null,null,null,null,{"$f":"($M$17+($I$33*$M$19))/(POWER(4*$T$33*$M$19,0.5))","v":45.499210934071819}]
[null,"erfc(z+(Ve)(t)/(4De)(t).5) =",null,null,null,null,null,null,{"$f":"IF($I$66>27,ERFC(27),ERFC($I$66))","v":0},null,null,null,null,"He+Ve",null,null,null,{"$f":"$I$33+$C$39","v":27916.265204386837}]
[null,null,null,null,null,null,null,null,null,null,null,null,null,"He(He+Ve)(t)",null,null,null,{"$f":"$C$39*($C$39+$I$33)*$M$19","v":284450877755.56677}]
[null,null,null,null,null,null,null,null,null,null,null,null,null,"(He+Ve)z",null,null,null,{"$f":"($C$39+$I$33)*$M$17","v":83748795.613160506}]
[null,null,null,null,null,null,null,null,null,null,null,null,null,"He(He+Ve)(t)+(He+Ve)z",null,null,null,{"$f":"$C$39*($C$39+$I$33)*$M$19+($C$39+$I$33)*$M$17","v":284534626551.17993}]
[null,null,null,null,null,null,null,null,null,null,null,null,null,"((He(He+Ve)(t)+(He+Ve)z)/De",null,null,null,{"$f":"($C$39*($C$39+$I$33)*$M$19+($C$39+$I$33)*$M$17)/$T$33","v":95231227376.771179}]
[null,null,null,null,null,null,null,null,null,null,null,null,null,"IF(F101>225,225,F101,1)",null,null,null,{"$f":"IF(($C$39*($C$39+$I$33)*$M$19+($C$39+$I$33)*$M$17)/$T$33>225,225,($C$39*($C$39+$I$33)*$M$19+($C$39+$I$33)*$M$17)/$T$33)","v":225}]
[null,null,null,null,null,null,null,null,null,null,null,null,null,"exp((He(He+Ve)(t)+(He+Ve)z)De",null,null,null,{"$f":"EXP(IF(($C$39*($C$39+$I$33)*$M$19+($C$39+$I$33)*$M$17)/$T$33>225,225,($C$39*($C$39+$I$33)*$M$19+($C$39+$I$33)*$M$17)/$T$33))","v":5.2030551378848545E+97}]
[]
[null,null,"K",null,null,null,null,null,null,null,null,null,null,null,null,null,"L"]
[]
[null,null,null,null,null,null,null,"erfc(z+(2He+Ve)t)/(4Det)1/2",null,null,null,null,null,null,null,null,"exp(He*L/De) ="]
[null,null,null,null,null,null,null,null,null,null,null,null,null,null,null,null,"(X)"]
[null,"z+(2He+Ve)t/(4Det)1/2 =",null,null,null,null,null,null,{"$f":"$M$17+(2*$C$39+$I$33)*$M19/POWER(4*$T$33*$M$19,0.5)","v":311550.15377454559},null,null,null,null,"He*L/De",null,null,null,{"$f":"$C$39*$M$13/$T$33","v":9343322.8221226092}]
[null,"erfc(z+(2He+Ve)t/(4Det)1/2) =",null,null,null,null,null,null,{"$f":"IF($M$17+(2*$C$39+$I$33)*$M19/POWER(4*$T$33*$M$19,0.5)>27,ERFC(27),ERFC(($M$17+(2*$C$39+$I$33)*$M19/POWER(4*$T$33*$M$19,0.5))))","v":0},null,null,null,null,"IF(F118>225,225,F1181",null,null,null,{"$f":"IF($C$39*$M$13/$T$33>225,225,$C$39*$M$13/$T$33)","v":225}]
[null,null,null,null,null,null,null,null,null,null,null,null,null,"exp(He*L/De) =",null,null,null,{"$f":"EXP(R80)","v":5.2030551378848545E+97}]
[]
[]
[null,null,"M",null,null,null,null,null,null,null,null,null,null,null,null,null,"N"]
[]
[null,null,null,null,null,null,null,"erfc(z+L+(2He+Ve)t)/(4Det)1/2",null,null,null,null,null,"u=.693/T1/2",null,null,null,{"$f":"0.693/$M$6","v":6.9299999999999997E-6}]
[null,null,null,null,null,null,null,null,null,null,null,null,null,"exp(-ut)",null,null,null,{"$f":"EXP(-0.693/$M$6*$M$19)","v":0.99747374636306974}]
[null,"z+L+(2He+Ve)t =",null,null,null,null,null,null,{"$f":"$M$17+$M$13+(2*$C$39+$I$33)*$M$19","v":20382868.504486538}]
[null,"(4Det)1/2=",null,null,null,null,null,null,{"$f":"POWER(4*$T$33*$M$19,0.5)","v":66.04718310844585}]
[null,"z+L+(2He+Ve)t/(4Det)1/2",null,null,null,null,null,null,{"$f":"($M$17+$M$13+(2*$C$39+$I$33)*$M$19)/POWER(4*$T$33*$M$19,0.5)","v":308610.71653909882}]
[null,"erfc(z+L+(2He+Ve)t)/(4Det)1/2",null,null,null,null,null,null,{"$f":"IF(($M$17+$M$13+(2*$C$39+$I$33)*$M$19)/POWER(4*$T$33*$M$19,0.5)>27,ERFC(27),ERFC(($M$17+$M$13+(2*$C$39+$I$33)*$M$19)/POWER(4*$T$33*$M$19,0.5)))","v":0}]
[]
[]
[]
[]
[]
[null,null,".5*Co(exp(-ut)(erfc(z-L-(Ve)(t)/(4De)(t).5 -erfc(z-(Ve)(t)/4De)(t).5)+(1+Ve/He)(exp((Ve)(z)/De)(erfc(z+L+(Ve)(t)/(4De)(t).5)-erfc(z+(Ve)(t)/(4De)(t).5)"]
[]
[]
[]
[]
[]
[null,null,null,null,null,null,null,null,null,null,null,null,null,null,null,null,null,null,null,{"$f":"POWER(4*$T$33*B126,0.5)","v":55.743539538584415}]
[]
[]
[]
[]
[]
[]
[]
[null,"depth",null,"exp(-ut)",null,"z-L-(Ve)(t)/(4De)(t).5",null,null,"erfc(z-L-(Ve)(t)/(4De)(t).5)",null,null,"z-(Ve)(t)/4De)(t).5)",null,"erfc(z-(Ve)(t)/4De)(t).5))",null,null,"erfc(z+L+(Ve)(t)/(4De)(t).5))",null,"    erfc(z+(Ve)(t)/(4De)(t).5)",null,null,"2+(Ve)/(He)exp((He(He+Ve)(t)+(He+Ve)z)/De)",null,null,null,"erfc(z+(2He+Ve)t)/(4Det)1/2",null,null,"erfc(z+L+(2He+Ve)t)/(4Det)1/2",null,null,"1+(Ve/He)(exp(Ve)(z)/De)",null,null,"Co/Ct ",null,"Ct (ug/kg)",null,"Cl (ug/l)",null,"Cg (ug/l)",null,"Cs (ug/kg)"]
[null,null,null,"(N)",null,null,null,null,"(E)",null,null,null,null,"(F)",null,null,"(H)",null,"             (I)",null,null,"(j)",null,null,null,"(K)",null,null,"(M)",null,null,null,null,null,null,null,null,null,"(Cl=Ct/Rl)",null,"(Cg=Ct/Rg)",null,"(Cl)(Foc)(Koc)"]
[]
[null,{"$f":"M17/150","v":20},null,{"$f":"EXP(-0.693/$M$6*$M$19)","v":0.99747374636306974},null,{"$f":"(B114-$M$13-($I$33*$M$19))/POWER(4*$T$33*$M$19,0.5)","v":-14.915014834697358},null,null,{"$f":"IF(F114>0,ERFC(IF(F114<27,F114,27)),1+ERF(IF(-F114<27,-F114,27)))","v":2},null,null,{"$f":"(B114-($M$19*$I$33))/POWER(4*$T$33*$M$19,0.5)","v":0.22567630360682711},null,{"$f":"IF(L114>0,ERFC(IF(L114<27,L114,27)),1+ERF(IF(-L114<27,-L114,27)))","v":0.74960936594943672},null,null,{"$f":"IF((B114+$M$13+$I$33*$M$19)/POWER(4*$T$33*$M$19,0.5)>27,ERFC(27),ERFC((B114+$M$13+$I$33*$M$19)/POWER(4*$T$33*$M$19,0.5)))","v":8.7553165908943276E-107},null,{"$f":"IF((B114+$I$33*$M$19)/(POWER(4*$T$33*$M$19,0.5))>27,ERFC(27),ERFC((B114+$I$33*$M$19)/(POWER(4*$T$33*$M$19,0.5))))","v":0.59103806980328244},null,null,{"$f":"(2+$I$33/$C$39)*EXP(IF(($C$39*($C$39+$I$33)*$M$19+($C$39+$I$33)*B114)/$T$33>225,225,($C$39*($C$39+$I$33)*$M$19+($C$39+$I$33)*B114)/$T$33))","v":1.0406112877297279E+98},null,null,null,{"$f":"IF((B114+((2*$C$39+$I$33)*$M$19))/POWER(4*$T$33*$M$19,0.5)>27,ERFC(27),ERFC((B114+((2*$C$39+$I$33)*$M$19))/POWER(4*$T$33*$M$19,0.5)))","v":0},null,null,{"$f":"IF((B114+$M$13+((2*$C$39+$I$33)*$M$19))/POWER(4*$T$33*$M$19,0.5)>27,ERFC(27),ERFC((B114+$M$13+((2*$C$39+$I$33)*$M$19))/POWER(4*$T$33*$M$19,0.5)))","v":0},null,null,{"$f":"1+($I$33/$C$39)*EXP($I$33*B114/$T$33)","v":1.0000005489686448},null,null,{"$f":"0.5*D114*((I114-N114)+(AF114)*(Q114-S114)+V114*(Z114-($R$81*AC114)))","v":0.3288432743960677},null,{"$f":"$M$4*AI114","v":32.884327439606771},null,{"$f":"AI114*$M$25","v":98.357908593041202},null,{"$f":"AI114*$M$26","v":98.357908593041202},null,{"$f":"AI114*$M$27","v":9.8357908593041207E-2}]
[null,{"$f":"B114+$M$17/150","v":40},null,0.99747374636306974,null,-14.612201011931274,null,null,2,null,null,0.52849012637291082,null,0.45482341004348248,null,null,6.4839540262667925E-111,null,{"$f":"IF((B115+$I$33*$M$19)/(POWER(4*$T$33*$M$19,0.5))>27,ERFC(27),ERFC((B115+$I$33*$M$19)/(POWER(4*$T$33*$M$19,0.5))))","v":0.33425651168196779},null,null,1.0406112877297279E+98,null,null,null,0,null,null,0,null,null,{"$f":"1+($I$33/$C$39)*EXP($I$33*B115/$T$33)","v":1.0000006027331461},null,null,{"$f":"0.5*D115*((I115-N115)+(AF115)*(Q115-S115)+V115*(Z115-($R$81*AC115)))","v":0.60393039303212792},null,{"$f":"$M$4*AI115","v":60.393039303212795},null,{"$f":"AI115*$M$25","v":180.6372062907661},null,{"$f":"AI115*$M$26","v":180.6372062907661},null,{"$f":"AI115*$M$27","v":0.18063720629076613}]
[null,{"$f":"B115+$M$17/150","v":60},null,0.99747374636306974,null,-14.309387189165191,null,null,2,null,null,0.83130394913899464,null,0.2397382367877956,null,null,3.9987005741961041E-115,null,0.16337221750202116,null,null,1.0406112877297279E+98,null,null,null,0,null,null,0,null,null,1.0000006617631967,null,null,0.79642764492347939,null,79.642764492347936,null,238.21365251948541,null,238.21365251948541,null,0.23821365251948542]
[null,80,null,0.99747374636306974,null,-14.006573366399106,null,null,2,null,null,1.1341177719050781,null,0.10873946234022996,null,null,2.0535389563170395E-119,null,6.8445489852792529E-2,null,null,1.0406112877297279E+98,null,null,null,0,null,null,0,null,null,1.0000007265744906,null,null,0.90910505252894469,null,90.910505252894467,null,271.91576845332349,null,271.91576845332349,null,0.27191576845332349]
[null,100,null,0.99747374636306974,null,-13.703759543633023,null,null,2,null,null,1.4369315946711618,null,4.2140684336773364E-2,null,null,8.7818626159250468E-124,null,2.4429527271021191E-2,null,null,1.0406112877297279E+98,null,null,null,0,null,null,0,null,null,1.000000797733227,null,null,0.96427271745925847,null,96.42727174592585,null,288.41656554115411,null,288.41656554115411,null,0.28841656554115414]
[null,120,null,0.99747374636306974,null,-13.40094572086694,null,null,2,null,null,1.7397454174372455,null,1.3879323942181138E-2,null,null,3.1272657066840473E-128,null,7.3941820638615497E-3,null,null,1.0406112877297279E+98,null,null,null,0,null,null,0,null,null,1.000000875861057,null,null,0.98686386126604975,null,98.686386126604972,null,295.17363746741273,null,295.17363746741273,null,0.29517363746741276]
[null,140,null,0.99747374636306974,null,-13.098131898100856,null,null,2,null,null,2.0425592402033295,null,3.869425359351625E-3,null,null,9.273260643191187E-133,null,1.8912888922758E-3,null,null,1.0406112877297279E+98,null,null,null,0,null,null,0,null,null,1.0000009616405152,null,null,0.99460066484284804,null,99.460066484284809,null,297.48773624412212,null,297.48773624412212,null,0.29748773624412211]
[null,160,null,0.99747374636306974,null,-12.795318075334771,null,null,2,null,null,2.3453730629694132,null,9.1035744243346127E-4,null,null,2.2897339974435117E-137,null,4.0771922758121371E-4,null,null,1.0406112877297279E+98,null,null,null,0,null,null,0,null,null,1.0000010558209809,null,null,0.9968163727113577,null,99.68163727113577,null,298.150460432111,null,298.150460432111,null,0.29815046043211108]
[null,180,null,0.99747374636306974,null,-12.492504252568688,null,null,2,null,null,2.6481868857354969,null,1.8032063655711302E-4,null,null,4.707800557537811E-142,null,7.3927094755208588E-5,null,null,1.0406112877297279E+98,null,null,null,0,null,null,0,null,null,1.000001159225226,null,null,0.99734694360180076,null,99.734694360180072,null,298.3091556136992,null,298.3091556136992,null,0.2983091556136992]
[null,200,null,0.99747374636306974,null,-12.189690429802605,null,null,2,null,null,2.9510007085015806,null,3.0015959493167501E-5,null,null,8.0598569277049166E-147,null,1.1255938657321798E-5,null,null,1.0406112877297279E+98,null,null,null,0,null,null,0,null,null,1.0000012727566028,null,null,0.99745316253849092,null,99.745316253849097,null,298.34092598359655,null,298.34092598359655,null,0.29834092598359657]
[null,220,null,0.99747374636306974,null,-11.886876607036521,null,null,2,null,null,3.2538145312676643,null,4.1928065434784784E-6,null,null,1.1489704595234837E-151,null,1.4372634796849258E-6,null,null,1.0406112877297279E+98,null,null,null,0,null,null,0,null,null,1.0000013974069351,null,null,0.99747093843854884,null,99.747093843854884,null,298.34624280315523,null,298.34624280315523,null,0.29834624280315525]
[null,240,null,0.99747374636306974,null,-11.584062784270436,null,null,2,null,null,3.556628354033748,null,4.909096406797043E-7,null,null,1.3638256046259504E-156,null,1.5375103229714238E-7,null,null,1.0406112877297279E+98,null,null,null,0,null,null,0,null,null,1.0000015342651827,null,null,0.99747342484690382,null,99.747342484690378,null,298.34698649458744,null,298.34698649458744,null,0.29834698649458746]
[null,260,null,0.99747374636306974,null,-11.281248961504353,null,null,2,null,null,3.8594421767998317,null,4.8132308111035997E-8,null,null,1.3479495419577973E-161,null,1.3767685229393383E-8,null,null,1.0406112877297279E+98,null,null,null,0,null,null,0,null,null,1.0000016845269564,null,null,0.99747371549124897,null,99.747371549124892,null,298.34707342709345,null,298.34707342709345,null,0.29834707342709349]
[null,280,null,0.99747374636306974,null,-10.97843513873827,null,null,2,null,null,4.1622559995659154,null,3.9489205566594953E-9,null,null,1.1093019894641495E-166,null,1.0312509818416822E-9,null,null,1.0406112877297279E+98,null,null,null,0,null,null,0,null,null,1.0000018495049607,null,null,0.99747374387927368,null,99.747374387927366,null,298.3470819180281,null,298.3470819180281,null,0.29834708191802811]
[null,300,null,0.99747374636306974,null,-10.675621315972187,null,null,2,null,null,4.4650698223319987,null,2.7092716726952583E-10,null,null,7.6012323666396918E-172,null,6.457713036545643E-11,null,null,1.0406112877297279E+98,null,null,null,0,null,null,0,null,null,1.000002030640464,null,null,0.99747374619574136,null,99.747374619574131,null,298.3470826108898,null,298.3470826108898,null,0.29834708261088982]
[null,320,null,0.99747374636306974,null,-10.372807493206102,null,null,2,null,null,4.7678836450980828,null,1.5535689320451073E-11,null,null,4.3368373627828959E-177,null,3.3790519389782882E-12,null,null,1.0406112877297279E+98,null,null,null,0,null,null,0,null,null,1.0000022295158872,null,null,0.99747374635363617,null,99.747374635363613,null,298.34708265811656,null,298.34708265811656,null,0.2983470826581166]
[null,340,null,0.99747374636306974,null,-10.069993670440018,null,null,2,null,null,5.070697467864167,null,7.4425186889075697E-13,null,null,2.0602226708241977E-182,null,1.4768487389026468E-13,null,null,1.0406112877297279E+98,null,null,null,0,null,null,0,null,null,1.0000024478686305,null,null,0.99747374636262487,null,99.747374636262492,null,298.34708266080509,null,298.34708266080509,null,0.29834708266080512]
[null,360,null,0.99747374636306974,null,-9.7671798476739351,null,null,2,null,null,5.3735112906302502,null,2.9775398853254298E-14,null,null,8.1489979478912497E-188,null,5.3895398509846219E-15,null,null,1.0406112877297279E+98,null,null,null,0,null,null,0,null,null,1.0000026876062496,null,null,0.99747374636305219,null,99.747374636305224,null,298.34708266093293,null,298.34708266093293,null,0.29834708266093296]
[null,380,null,0.99747374636306974,null,-9.4643660249078518,null,null,2,null,null,5.6763251133963344,null,9.9449824486153914E-16,null,null,2.6837405077618897E-193,null,1.6417717885022118E-16,null,null,1.0406112877297279E+98,null,null,null,0,null,null,0,null,null,1.0000029508231214,null,null,0.99747374636306918,null,99.747374636306915,null,298.34708266093799,null,298.34708266093799,null,0.29834708266093801]
[null,400,null,0.99747374636306974,null,-9.1615522021417668,null,null,2,null,null,5.9791389361624177,null,2.7722934971113607E-17,null,null,7.3590281445074816E-199,null,4.1735714376673497E-18,null,null,1.0406112877297279E+98,null,null,null,0,null,null,0,null,null,1.0000032398187402,null,null,0.99747374636306974,null,99.747374636306972,null,298.34708266093816,null,298.34708266093816,null,0.29834708266093818]
[null,420,null,0.99747374636306974,null,-8.8587383793756835,null,null,2,null,null,6.2819527589285018,null,6.4485070820049548E-19,null,null,1.6801246746916282E-204,null,8.8519719365033647E-20,null,null,1.0406112877297279E+98,null,null,null,0,null,null,0,null,null,1.0000035571178068,null,null,0.99747374636306974,null,99.747374636306972,null,298.34708266093816,null,298.34708266093816,null,0.29834708266093818]
[null,440,null,0.99747374636306974,null,-8.5559245566096003,null,null,2,null,null,6.5847665816945851,null,1.2513343316037206E-20,null,null,3.1937523608715384E-210,null,1.56611875429141E-21,null,null,1.0406112877297279E+98,null,null,null,0,null,null,0,null,null,1.0000039054922836,null,null,0.99747374636306974,null,99.747374636306972,null,298.34708266093816,null,298.34708266093816,null,0.29834708266093818]
[null,460,null,0.99747374636306974,null,-8.253110733843517,null,null,2,null,null,6.8875804044606692,null,2.0253606838218975E-22,null,null,5.0547226045622647E-216,null,2.3109337250132158E-23,null,null,1.0406112877297279E+98,null,null,null,0,null,null,0,null,null,1.0000042879856128,null,null,0.99747374636306974,null,99.747374636306972,null,298.34708266093816,null,298.34708266093816,null,0.29834708266093818]
[null,480,null,0.99747374636306974,null,-7.9502969110774329,null,null,2,null,null,7.1903942272267525,null,2.7338603681185703E-24,null,null,6.6608176972468909E-222,null,2.8435625842361948E-25,null,null,1.0406112877297279E+98,null,null,null,0,null,null,0,null,null,1.0000047079393017,null,null,0.99747374636306974,null,99.747374636306972,null,298.34708266093816,null,298.34708266093816,null,0.29834708266093818]
[null,500,null,0.99747374636306974,null,-7.6474830883113496,null,null,2,null,null,7.4932080499928366,null,3.0770416106491312E-26,null,null,7.3078522719255567E-228,null,2.9173757835771237E-27,null,null,1.0406112877297279E+98,null,null,null,0,null,null,0,null,null,1.000005169022117,null,null,0.99747374636306974,null,99.747374636306972,null,298.34708266093816,null,298.34708266093816,null,0.29834708266093818]
[null,520,null,0.99747374636306974,null,-7.3446692655452663,null,null,2,null,null,7.7960218727589208,null,2.8874768852255929E-28,null,null,6.6754709104026152E-234,null,2.4953092579102839E-29,null,null,1.0406112877297279E+98,null,null,null,0,null,null,0,null,null,1.0000056752621334,null,null,0.99747374636306974,null,99.747374636306972,null,298.34708266093816,null,298.34708266093816,null,0.29834708266093818]
[null,540,null,0.99747374636306974,null,-7.0418554427791822,null,null,2,null,null,8.098835695525004,null,2.2588255788178081E-30,null,null,5.0769398273697367E-240,null,1.779149407434104E-31,null,null,1.0406112877297279E+98,null,null,null,0,null,null,0,null,null,1.0000062310819249,null,null,0.99747374636306974,null,99.747374636306972,null,298.34708266093816,null,298.34708266093816,null,0.29834708266093818]
[null,560,null,0.99747374636306974,null,-6.7390416200130989,null,null,2,null,null,8.4016495182910891,null,1.4729294229845846E-32,null,null,3.2147572499702691E-246,null,1.0573404786414666E-33,null,null,1.0406112877297279E+98,null,null,null,0,null,null,0,null,null,1.0000068413372003,null,null,0.99747374636306974,null,99.747374636306972,null,298.34708266093816,null,298.34708266093816,null,0.29834708266093818]
[null,580,null,0.99747374636306974,null,-6.4362277972470148,null,null,2,null,null,8.7044633410571723,null,8.0052830023366141E-35,null,null,1.6948005031674528E-252,null,5.2371398972062371E-36,null,null,1.0406112877297279E+98,null,null,null,0,null,null,0,null,null,1.0000075113592233,null,null,0.99747374636306974,null,99.747374636306972,null,298.34708266093816,null,298.34708266093816,null,0.29834708266093818]
[null,600,null,0.99747374636306974,null,-6.1334139744809306,null,null,2,null,null,9.0072771638232556,null,3.6260289067002232E-37,null,null,7.4389468467807401E-259,null,2.1618046854267829E-38,null,null,1.0406112877297279E+98,null,null,null,0,null,null,0,null,null,1.0000082470013874,null,null,0.99747374636306974,null,99.747374636306972,null,298.34708266093816,null,298.34708266093816,null,0.29834708266093818]
[null,620,null,0.99747374636306974,null,-5.8306001517148474,null,null,2,null,null,9.3100909865893389,null,1.3687159876186544E-39,null,null,2.7184734962696636E-265,null,7.4361979072917325E-41,null,null,1.0406112877297279E+98,null,null,null,0,null,null,0,null,null,1.0000090546903511,null,null,0.99747374636306974,null,99.747374636306972,null,298.34708266093816,null,298.34708266093816,null,0.29834708266093818]
[null,640,null,0.99747374636306974,null,-5.5277863289487632,null,null,1.9999999999999947,null,null,9.6129048093554239,null,4.3052024427621225E-42,null,null,8.2709975816788035E-272,null,2.1314230634900491E-43,null,null,1.0406112877297279E+98,null,null,null,0,null,null,0,null,null,1.0000099414821828,null,null,0.99747374636306707,null,99.747374636306702,null,298.34708266093736,null,298.34708266093736,null,0.2983470826609374]
[null,660,null,{"$f":"EXP(-0.693/$M$6*$M$19)","v":0.99747374636306974},null,{"$f":"(B146-$M$13-($I$33*$M$19))/POWER(4*$T$33*$M$19,0.5)","v":-5.2249725061826799},null,null,{"$f":"IF(F146>0,ERFC(IF(F146<27,F146,27)),1+ERF(IF(-F146<27,-F146,27)))","v":1.9999999999998523},null,null,{"$f":"(B146-($M$19*$I$33))/POWER(4*$T$33*$M$19,0.5)","v":9.9157186321215072},null,{"$f":"IF(L146>0,ERFC(IF(L146<27,L146,27)),1+ERF(IF(-L146<27,-L146,27)))","v":1.1283536759188716E-44},null,null,{"$f":"IF((B146+$M$13+$I$33*$M$19)/POWER(4*$T$33*$M$19,0.5)>27,ERFC(27),ERFC((B146+$M$13+$I$33*$M$19)/POWER(4*$T$33*$M$19,0.5)))","v":2.0951168658840168E-278},null,{"$f":"IF((B146+$I$33*$M$19)/(POWER(4*$T$33*$M$19,0.5))>27,ERFC(27),ERFC((B146+$I$33*$M$19)/(POWER(4*$T$33*$M$19,0.5))))","v":5.0903436922092276E-46},null,null,{"$f":"(2+$I$33/$C$39)*EXP(IF(($C$39*($C$39+$I$33)*$M$19+($C$39+$I$33)*B146)/$T$33>225,225,($C$39*($C$39+$I$33)*$M$19+($C$39+$I$33)*B146)/$T$33))","v":1.0406112877297279E+98},null,null,null,{"$f":"IF((B146+((2*$C$39+$I$33)*$M$19))/POWER(4*$T$33*$M$19,0.5)>27,ERFC(27),ERFC((B146+((2*$C$39+$I$33)*$M$19))/POWER(4*$T$33*$M$19,0.5)))","v":0},null,null,{"$f":"IF((B146+$M$13+((2*$C$39+$I$33)*$M$19))/POWER(4*$T$33*$M$19,0.5)>27,ERFC(27),ERFC((B146+$M$13+((2*$C$39+$I$33)*$M$19))/POWER(4*$T$33*$M$19,0.5)))","v":0},null,null,1.0000109151240031,null,null,0.99747374636299613,null,99.747374636299611,null,298.34708266091616,null,298.34708266091616,null,0.29834708266091614]
[null,680,null,0.99747374636306974,null,-4.9221586834165958,null,null,1.9999999999966209,null,null,10.21853245488759,null,2.4640183730410932E-47,null,null,4.4184979940172391E-285,null,1.0128845507217332E-48,null,null,1.0406112877297279E+98,null,null,null,0,null,null,0,null,null,1.0000119841216644,null,null,0.99747374636138442,null,99.747374636138446,null,298.34708266043407,null,298.34708266043407,null,0.29834708266043408]
[null,700,null,0.99747374636306974,null,-4.6193448606505125,null,null,1.9999999999354228,null,null,10.521346277653674,null,4.4829852641566138E-50,null,null,7.7581050573864673E-292,null,1.679139572945333E-51,null,null,1.0406112877297279E+98,null,null,null,0,null,null,0,null,null,1.0000131578140592,null,null,0.99747374633086272,null,99.747374633086267,null,298.34708265130496,null,298.34708265130496,null,0.298347082651305]
[null,720,null,0.99747374636306974,null,-4.3165310378844284,null,null,1.9999999989687489,null,null,10.824160100419759,null,6.7950842422876904E-53,null,null,1.1340960073550711E-298,null,2.3190387427471444E-54,null,null,1.0406112877297279E+98,null,null,null,0,null,null,0,null,null,1.0000144464547063,null,null,0.99747374584874682,null,99.747374584874677,null,298.34708250710281,null,298.34708250710281,null,0.29834708250710279]
[null,740,null,0.99747374636306974,null,-4.0137172151183451,null,null,1.9999999862323148,null,null,11.126973923185842,null,8.5804027792954232E-56,null,null,1.3802437589909036E-305,null,2.668120686547633E-57,null,null,1.0406112877297279E+98,null,null,null,0,null,null,0,null,null,1.0000158613013255,null,null,0.99747373949661744,null,99.74737394966175,null,298.34708060716378,null,298.34708060716378,null,0.29834708060716381]
[null,760,null,0.99747374636306974,null,-3.7109033923522614,null,null,1.9999998462489676,null,null,11.429787745951925,null,9.0258560760713813E-59,null,null,0,null,2.5571870157118962E-60,null,null,1.0406112877297279E+98,null,null,null,0,null,null,0,null,null,1.0000174147141878,null,null,0.99747366968176066,null,99.747366968176067,null,298.34705972535221,null,298.34705972535221,null,0.29834705972535219]
[null,780,null,0.99747374636306974,null,-3.4080895695861777,null,null,1.9999985627365202,null,null,11.732601568718009,null,7.9089888159395886E-62,null,null,0,null,2.0415669102548973E-63,null,null,1.0406112877297279E+98,null,null,null,0,null,null,0,null,null,1.0000191202640958,null,null,0.99747302954677586,null,99.747302954677579,null,298.34686825925502,null,298.34686825925502,null,0.29834686825925505]
[null,800,null,0.99747374636306974,null,-3.105275746820094,null,null,1.9999887440613426,null,null,12.035415391484094,null,5.7728526116211863E-65,null,null,0,null,1.3576709905674636E-66,null,null,1.0406112877297279E+98,null,null,null,0,null,null,0,null,null,1.0000209928509389,null,null,0.99746813261141909,null,99.746813261141909,null,298.34540357270765,null,298.34540357270765,null,0.29834540357270767]
[null,820,null,0.99747374636306974,null,-2.8024619240540103,null,null,1.9999260729052448,null,null,12.338229214250177,null,3.5098061508340584E-68,null,null,0,null,7.5204177269993049E-70,null,null,1.0406112877297279E+98,null,null,null,0,null,null,0,null,null,1.0000230488338624,null,null,0.99743687619498811,null,99.743687619498814,null,298.33605469441324,null,298.33605469441324,null,0.29833605469441327]
[null,840,null,0.99747374636306974,null,-2.4996481012879266,null,null,1.9995922807724189,null,null,12.64104303701626,null,1.7774038860102892E-71,null,null,0,null,3.4697128895534218E-73,null,null,1.0406112877297279E+98,null,null,null,0,null,null,0,null,null,1.0000253061741808,null,null,0.99727040175036996,null,99.72704017503699,null,298.28626173989136,null,298.28626173989136,null,0.29828626173989137]
[null,860,null,0.99747374636306974,null,-2.1968342785218429,null,null,1.998108711107724,null,null,12.943856859782343,null,7.4970001952467538E-75,null,null,0,null,1.3333303152445311E-76,null,null,1.0406112877297279E+98,null,null,null,0,null,null,0,null,null,1.000027784592292,null,null,0.99653049085465306,null,99.653049085465312,null,298.06495239919838,null,298.06495239919838,null,0.29806495239919839]
[null,880,null,0.99747374636306974,null,-1.8940204557557589,null,null,1.9926058179361386,null,null,13.246670682548428,null,2.6337600054409447E-78,null,null,0,null,4.2674050637088282E-80,null,null,1.0406112877297279E+98,null,null,null,0,null,null,0,null,null,1.0000305057399557,null,null,0.99378599512080446,null,99.378599512080442,null,297.2440663372297,null,297.2440663372297,null,0.29724406633722972]
[null,900,null,0.99747374636306974,null,-1.5912066329896752,null,null,1.9755704727289789,null,null,13.549484505314512,null,7.7062264919014002E-82,null,null,0,null,1.1375273546861762E-83,null,null,1.0406112877297279E+98,null,null,null,0,null,null,0,null,null,1.0000334933894461,null,null,0.98528984031861766,null,98.528984031861768,null,294.70284356489066,null,294.70284356489066,null,0.29470284356489068]
[null,920,null,0.99747374636306974,null,-1.2883928102235915,null,null,1.9315545101472074,null,null,13.852298328080595,null,1.8779089118737442E-85,null,null,0,null,2.5253542383375469E-87,null,null,1.0406112877297279E+98,null,null,null,0,null,null,0,null,null,1.0000367736412303,null,null,0.96333745677050941,null,96.333745677050942,null,288.13682655149836,null,288.13682655149836,null,0.28813682655149842]
[null,940,null,0.99747374636306974,null,-0.98557898745750783,null,null,1.8366277824979789,null,null,14.155112150846678,null,3.8112318228787482E-89,null,null,0,null,4.6691351029842255E-91,null,null,1.0406112877297279E+98,null,null,null,0,null,null,0,null,null,1.0000403751519837,null,null,0.9159939974413781,null,91.599399744137813,null,273.97627042115005,null,273.97627042115005,null,0.27397627042115003]
[null,960,null,0.99747374636306974,null,-0.68276516469142401,null,null,1.6657434883180322,null,null,14.457925973612763,null,6.4417782514591204E-93,null,null,0,null,7.1894554105910054E-95,null,null,1.0406112877297279E+98,null,null,null,0,null,null,0,null,null,1.0000443293849388,null,null,0.83076769888623792,null,83.076769888623787,null,248.48485510056972,null,248.48485510056972,null,0.24848485510056972]
[null,980,null,0.99747374636306974,null,-0.37995134192534036,null,null,1.4089619301967176,null,null,14.760739796378846,null,9.0675034578715516E-97,null,null,0,null,9.2191994353745535E-99,null,null,1.0406112877297279E+98,null,null,null,0,null,null,0,null,null,1.0000486708847525,null,null,0.70270126749813089,null,70.270126749813087,null,210.17984072725753,null,210.17984072725753,null,0.21017984072725754]
[null,1000,null,0.99747374636306974,null,-7.713751915925661E-2,null,null,1.0868680415716558,null,null,15.06355361914493,null,1.0629276757805709E-100,null,null,0,null,9.8451148819312622E-103,null,null,1.0406112877297279E+98,null,null,null,0,null,null,0,null,null,1.0000534375792909,null,null,0.54206116861438614,null,54.206116861438616,null,162.13195472015539,null,162.13195472015539,null,0.1621319547201554]
[null,1020,null,0.99747374636306974,null,0.22567630360682711,null,null,0.74960936594943672,null,null,15.366367441911013,null,1.037639844493491E-104,null,null,0,null,8.7553165908943276E-107,null,null,1.0406112877297279E+98,null,null,null,0,null,null,0,null,null,1.0000586711109729,null,null,0.37385783128121497,null,37.385783128121496,null,111.82188373316501,null,111.82188373316501,null,0.11182188373316503]
[null,1040,null,0.99747374636306974,null,0.52849012637291082,null,null,0.45482341004348248,null,null,15.669181264677096,null,8.4354805045168849E-109,null,null,0,null,6.4839540262667925E-111,null,null,1.0406112877297279E+98,null,null,null,0,null,null,0,null,null,1.0000644172005635,null,null,0.22683720537484955,null,22.683720537484955,null,67.847618756186321,null,67.847618756186321,null,6.784761875618632E-2]
[null,1060,null,0.99747374636306974,null,0.83130394913899464,null,null,0.2397382367877956,null,null,15.97199508744318,null,5.7106687880318446E-113,null,null,0,null,3.9987005741961041E-115,null,null,1.0406112877297279E+98,null,null,null,0,null,null,0,null,null,1.0000707260465946,null,null,0.1195662985975996,null,11.956629859759961,null,35.762601773958011,null,35.762601773958011,null,3.5762601773958014E-2]
[null,1080,null,0.99747374636306974,null,1.1341177719050781,null,null,0.10873946234022996,null,null,16.274808910209263,null,3.2193791518130205E-117,null,null,0,null,2.0535389563170395E-119,null,null,1.0406112877297279E+98,null,null,null,0,null,null,0,null,null,1.000077652763907,null,null,5.4232379439007557E-2,null,5.4232379439007561,null,16.221050679663279,null,16.221050679663279,null,1.6221050679663281E-2]
[null,1100,null,0.99747374636306974,null,1.4369315946711618,null,null,4.2140684336773364E-2,null,null,16.577622732975346,null,1.5113312547013338E-121,null,null,0,null,8.7818626159250468E-124,null,null,1.0406112877297279E+98,null,null,null,0,null,null,0,null,null,1.0000852578651394,null,null,2.1017113139852429E-2,null,2.101711313985243,null,6.2862751166059123,null,6.2862751166059123,null,6.2862751166059124E-3]
[null,1120,null,0.99747374636306974,null,1.7397454174372455,null,null,1.3879323942181138E-2,null,null,16.880436555741429,null,5.9080512734194947E-126,null,null,0,null,3.1272657066840473E-128,null,null,1.0406112877297279E+98,null,null,null,0,null,null,0,null,null,1.0000936077893741,null,null,6.9221306247970347E-3,null,0.69221306247970349,null,2.0704279037279272,null,2.0704279037279272,null,2.0704279037279272E-3]
[null,1140,null,0.99747374636306974,null,2.0425592402033295,null,null,3.869425359351625E-3,null,null,17.183250378507516,null,1.9231840891858767E-130,null,null,0,null,9.273260643191187E-133,null,null,1.0406112877297279E+98,null,null,null,0,null,null,0,null,null,1.0001027754825571,null,null,1.9298251047323665E-3,null,0.19298251047323664,null,0.57721588376840482,null,0.57721588376840482,null,5.7721588376840488E-4]
[null,1160,null,0.99747374636306974,null,2.3453730629694132,null,null,9.1035744243346127E-4,null,null,17.486064201273599,null,5.2129634961136464E-135,null,null,0,null,2.2897339974435117E-137,null,null,1.0406112877297279E+98,null,null,null,0,null,null,0,null,null,1.0001128410347631,null,null,4.540288243168036E-4,null,4.5402882431680364E-2,null,0.13580124356434806,null,0.13580124356434806,null,1.3580124356434806E-4]
[null,1180,null,0.99747374636306974,null,2.6481868857354969,null,null,1.8032063655711302E-4,null,null,17.788878024039683,null,1.1766063649388674E-139,null,null,0,null,4.707800557537811E-142,null,null,1.0406112877297279E+98,null,null,null,0,null,null,0,null,null,1.000123892379871,null,null,8.9932550446598518E-5,null,8.9932550446598526E-3,null,2.6899067930188994E-2,null,2.6899067930188994E-2,null,2.6899067930188995E-5]
[null,1200,null,0.99747374636306974,null,2.9510007085015806,null,null,3.0015959493167501E-5,null,null,18.091691846805766,null,2.2113428003854784E-144,null,null,0,null,8.0598569277049166E-147,null,null,1.0406112877297279E+98,null,null,null,0,null,null,0,null,null,1.0001360260637662,null,null,1.4970065783165967E-5,null,1.4970065783165966E-3,null,4.4775869740277079E-3,null,4.4775869740277079E-3,null,4.4775869740277078E-6]
[null,1220,null,0.99747374636306974,null,3.2538145312676643,null,null,4.1928065434784784E-6,null,null,18.394505669571849,null,3.4606303843597507E-149,null,null,0,null,1.1489704595234837E-151,null,null,1.0406112877297279E+98,null,null,null,0,null,null,0,null,null,1.0001493480877757,null,null,2.0911072253495354E-6,null,2.0911072253495353E-4,null,6.2545580020424794E-4,null,6.2545580020424794E-4,null,6.2545580020424807E-7]
[null,1240,null,0.99747374636306974,null,3.556628354033748,null,null,4.909096406797043E-7,null,null,18.697319492337932,null,4.5094619241489017E-154,null,null,0,null,1.3638256046259504E-156,null,null,1.0406112877297279E+98,null,null,null,0,null,null,0,null,null,1.0001639748347093,null,null,2.4483473920726651E-7,null,2.4483473920726653E-5,null,7.323072957345959E-5,null,7.323072957345959E-5,null,7.3230729573459595E-8]
[null,1260,null,0.99747374636306974,null,3.8594421767998317,null,null,4.8132308111035997E-8,null,null,19.000133315104016,null,4.8928384579383205E-159,null,null,0,null,1.3479495419577973E-161,null,null,1.0406112877297279E+98,null,null,null,0,null,null,0,null,null,1.0001800340855946,null,null,2.400535684630832E-8,null,2.400535684630832E-6,null,7.1800668533325003E-6,null,7.1800668533325003E-6,null,7.1800668533325008E-9]
[null,1280,null,0.99747374636306974,null,4.1622559995659154,null,null,3.9489205566594953E-9,null,null,19.302947137870099,null,4.4203853661773834E-164,null,null,0,null,1.1093019894641495E-166,null,null,1.0406112877297279E+98,null,null,null,0,null,null,0,null,null,1.0001976661359855,null,null,1.9694722908706426E-9,null,1.9694722908706427E-7,null,5.8907446386958415E-7,null,5.8907446386958415E-7,null,5.8907446386958423E-10]
[null,1300,null,{"$f":"EXP(-0.693/$M$6*$M$19)","v":0.99747374636306974},null,{"$f":"(B178-$M$13-($I$33*$M$19))/POWER(4*$T$33*$M$19,0.5)","v":4.4650698223319987},null,null,{"$f":"IF(F178>0,ERFC(IF(F178<27,F178,27)),1+ERF(IF(-F178<27,-F178,27)))","v":2.7092716726952583E-10},null,null,{"$f":"(B178-($M$19*$I$33))/POWER(4*$T$33*$M$19,0.5)","v":19.605760960636186},null,{"$f":"IF(L178>0,ERFC(IF(L178<27,L178,27)),1+ERF(IF(-L178<27,-L178,27)))","v":3.3252102485541057E-169},null,null,{"$f":"IF((B178+$M$13+$I$33*$M$19)/POWER(4*$T$33*$M$19,0.5)>27,ERFC(27),ERFC((B178+$M$13+$I$33*$M$19)/POWER(4*$T$33*$M$19,0.5)))","v":0},null,{"$f":"IF((B178+$I$33*$M$19)/(POWER(4*$T$33*$M$19,0.5))>27,ERFC(27),ERFC((B178+$I$33*$M$19)/(POWER(4*$T$33*$M$19,0.5))))","v":7.6012323666396918E-172},null,null,{"$f":"(2+$I$33/$C$39)*EXP(IF(($C$39*($C$39+$I$33)*$M$19+($C$39+$I$33)*B178)/$T$33>225,225,($C$39*($C$39+$I$33)*$M$19+($C$39+$I$33)*B178)/$T$33))","v":1.0406112877297279E+98},null,null,null,{"$f":"IF((B178+((2*$C$39+$I$33)*$M$19))/POWER(4*$T$33*$M$19,0.5)>27,ERFC(27),ERFC((B178+((2*$C$39+$I$33)*$M$19))/POWER(4*$T$33*$M$19,0.5)))","v":0},null,null,{"$f":"IF((B178+$M$13+((2*$C$39+$I$33)*$M$19))/POWER(4*$T$33*$M$19,0.5)>27,ERFC(27),ERFC((B178+$M$13+((2*$C$39+$I$33)*$M$19))/POWER(4*$T$33*$M$19,0.5)))","v":0},null,null,1.0002170250216031,null,null,1.3512136826393398E-10,null,1.3512136826393399E-8,null,4.0415164984227517E-8,null,4.0415164984227517E-8,null,4.0415164984227522E-11]
[null,1320,null,0.99747374636306974,null,4.7678836450980828,null,null,1.5535689320451073E-11,null,null,19.908574783402269,null,2.0827377331626818E-174,null,null,0,null,4.3368373627828959E-177,null,null,1.0406112877297279E+98,null,null,null,0,null,null,0,null,null,{"$f":"1+($I$33/$C$39)*EXP($I$33*B179/$T$33)","v":1.000238279864009},null,null,{"$f":"0.5*D179*((I179-N179)+(AF179)*(Q179-S179)+V179*(Z179-($R$81*AC179)))","v":7.7482211144015324E-12},null,{"$f":"$M$4*AI179","v":7.748221114401532E-10},null,{"$f":"AI179*$M$25","v":2.3175137929416353E-9},null,{"$f":"AI179*$M$26","v":2.3175137929416353E-9},null,{"$f":"AI179*$M$27","v":2.3175137929416356E-12}]
[null,{"$f":"B179+$M$17/150","v":1340},null,0.99747374636306974,null,5.070697467864167,null,null,7.4425186889075697E-13,null,null,20.211388606168352,null,1.0861841875994921E-179,null,null,0,null,2.0602226708241977E-182,null,null,1.0406112877297279E+98,null,null,null,0,null,null,0,null,null,1.0002616163480724,null,null,3.7118584995008975E-13,null,3.7118584995008974E-11,null,1.1102268692425418E-10,null,1.1102268692425418E-10,null,1.1102268692425419E-13]
[null,1360,null,0.99747374636306974,null,5.3735112906302502,null,null,2.9775398853254298E-14,null,null,20.514202428934436,null,4.7165325736490981E-185,null,null,0,null,8.1489979478912497E-188,null,null,1.0406112877297279E+98,null,null,null,0,null,null,0,null,null,1.0002872383441355,null,null,1.4850089321805107E-14,null,1.4850089321805107E-12,null,4.4417016914671317E-12,null,4.4417016914671317E-12,null,4.4417016914671315E-15]
[null,1380,null,0.99747374636306974,null,5.6763251133963344,null,null,9.9449824486153914E-16,null,null,20.817016251700519,null,1.7052570533938502E-190,null,null,0,null,2.6837405077618897E-193,null,null,1.0406112877297279E+98,null,null,null,0,null,null,0,null,null,1.0003153696890488,null,null,4.9599294502676848E-16,null,4.9599294502676847E-14,null,1.4835282503293178E-13,null,1.4835282503293178E-13,null,1.4835282503293178E-16]
[null,1400,null,0.99747374636306974,null,5.9791389361624177,null,null,2.7722934971113607E-17,null,null,21.119830074466602,null,5.1333612705891105E-196,null,null,0,null,7.3590281445074816E-199,null,null,1.0406112877297279E+98,null,null,null,0,null,null,0,null,null,1.0003462561416376,null,null,1.3826449902908226E-17,null,1.3826449902908225E-15,null,4.1355283857153224E-15,null,4.1355283857153224E-15,null,4.1355283857153225E-18]
[null,1420,null,0.99747374636306974,null,6.2819527589285018,null,null,6.4485070820049548E-19,null,null,21.422643897232685,null,1.2866374312100464E-201,null,null,0,null,1.6801246746916282E-204,null,null,1.0406112877297279E+98,null,null,null,0,null,null,0,null,null,1.0003801675296804,null,null,3.2161082587681346E-19,null,3.2161082587681345E-17,null,9.6194663771728868E-17,null,9.6194663771728868E-17,null,9.6194663771728871E-20]
[null,1440,null,0.99747374636306974,null,6.5847665816945851,null,null,1.2513343316037206E-20,null,null,21.725457719998769,null,2.6850380050734133E-207,null,null,0,null,3.1937523608715384E-210,null,null,1.0406112877297279E+98,null,null,null,0,null,null,0,null,null,1.0004174001071571,null,null,6.2408657184874551E-21,null,6.2408657184874555E-19,null,1.8666597363372252E-18,null,1.8666597363372252E-18,null,1.8666597363372253E-21]
[null,1460,null,0.99747374636306974,null,6.8875804044606692,null,null,2.0253606838218975E-22,null,null,22.028271542764855,null,4.6653284431204175E-213,null,null,0,null,5.0547226045622647E-216,null,null,1.0406112877297279E+98,null,null,null,0,null,null,0,null,null,1.0004582791423591,null,null,1.0101220545141485E-22,null,1.0101220545141485E-20,null,3.0213022567721294E-20,null,3.0213022567721294E-20,null,3.0213022567721301E-23]
[null,1480,null,0.99747374636306974,null,7.1903942272267525,null,null,2.7338603681185703E-24,null,null,22.331085365530939,null,6.7491528845664348E-219,null,null,0,null,6.6608176972468909E-222,null,null,1.0406112877297279E+98,null,null,null,0,null,null,0,null,null,1.0005031617594731,null,null,1.3634769717103756E-24,null,1.3634769717103756E-22,null,4.0781963261526695E-22,null,4.0781963261526695E-22,null,4.07819632615267E-25]
[null,1500,null,0.99747374636306974,null,7.4932080499928366,null,null,3.0770416106491312E-26,null,null,22.633899188297022,null,8.1292294059624925E-225,null,null,0,null,7.3078522719255567E-228,null,null,1.0406112877297279E+98,null,null,null,0,null,null,0,null,null,1.0005524400584604,null,null,1.5346341115446216E-26,null,1.5346341115446215E-24,null,4.5901319388174135E-24,null,4.5901319388174135E-24,null,4.5901319388174136E-27]
[null,1520,null,0.99747374636306974,null,7.7960218727589208,null,null,2.8874768852255929E-28,null,null,22.936713011063105,null,8.1523058754053981E-231,null,null,0,null,6.6754709104026152E-234,null,null,1.0406112877297279E+98,null,null,null,0,null,null,0,null,null,1.0006065445404901,null,null,1.4400911931213698E-28,null,1.4400911931213697E-26,null,4.307351524789741E-26,null,4.307351524789741E-26,null,4.3073515247897416E-29]
[null,1540,null,0.99747374636306974,null,8.098835695525004,null,null,2.2588255788178081E-30,null,null,23.239526833829188,null,6.8067611252431416E-237,null,null,0,null,5.0769398273697367E-240,null,null,1.0406112877297279E+98,null,null,null,0,null,null,0,null,null,1.0006659478688484,null,null,1.1265596062420643E-30,null,1.1265596062420643E-28,null,3.3695701084009905E-28,null,3.3695701084009905E-28,null,3.3695701084009911E-31]
[null,1560,null,0.99747374636306974,null,8.4016495182910891,null,null,1.4729294229845846E-32,null,null,23.542340656595272,null,4.7318129930462387E-243,null,null,0,null,3.2147572499702691E-246,null,null,1.0406112877297279E+98,null,null,null,0,null,null,0,null,null,1.0007311689981837,null,null,7.3460421483641412E-33,null,7.3460421483641407E-31,null,2.197220981564549E-30,null,2.197220981564549E-30,null,2.1972209815645493E-33]
[null,1580,null,0.99747374636306974,null,8.7044633410571723,null,null,8.0052830023366141E-35,null,null,23.845154479361355,null,2.7386705352743225E-249,null,null,0,null,1.6948005031674528E-252,null,null,1.0406112877297279E+98,null,null,null,0,null,null,0,null,null,1.000802777708155,null,null,3.9925298135186527E-35,null,3.9925298135186524E-33,null,1.1941764148111626E-32,null,1.1941764148111626E-32,null,1.1941764148111626E-35]
[null,1600,null,0.99747374636306974,null,9.0072771638232556,null,null,3.6260289067002232E-37,null,null,24.147968302127438,null,1.3197004539693529E-255,null,null,0,null,7.4389468467807401E-259,null,null,1.0406112877297279E+98,null,null,null,0,null,null,0,null,null,1.0008813995810975,null,null,1.8084343189935288E-37,null,1.8084343189935288E-35,null,5.409075729791214E-35,null,5.409075729791214E-35,null,5.4090757297912141E-38]
[null,1620,null,0.99747374636306974,null,9.3100909865893389,null,null,1.3687159876186544E-39,null,null,24.450782124893525,null,5.2945929236906964E-262,null,null,0,null,2.7184734962696636E-265,null,null,1.0406112877297279E+98,null,null,null,0,null,null,0,null,null,1.0009677214671844,null,null,6.8262913193850407E-40,null,6.8262913193850412E-38,null,2.0417621094870513E-37,null,2.0417621094870513E-37,null,2.0417621094870517E-40]
[null,1640,null,0.99747374636306974,null,9.6129048093554239,null,null,4.3052024427621225E-42,null,null,24.753595947659608,null,1.7685190865436082E-268,null,null,0,null,8.2709975816788035E-272,null,null,1.0406112877297279E+98,null,null,null,0,null,null,0,null,null,1.0010624974848339,null,null,2.1471632047166869E-42,null,2.1471632047166869E-40,null,6.4222229453141198E-40,null,6.4222229453141198E-40,null,6.4222229453141195E-43]
[null,1660,null,0.99747374636306974,null,9.9157186321215072,null,null,1.1283536759188716E-44,null,null,25.056409770425692,null,4.918189871858028E-275,null,null,0,null,2.0951168658840168E-278,null,null,1.0406112877297279E+98,null,null,null,0,null,null,0,null,null,1.0011665556087774,null,null,5.6275158417066888E-45,null,5.627515841706689E-43,null,1.6832051371007048E-42,null,1.6832051371007048E-42,null,1.683205137100705E-45]
[null,1680,null,0.99747374636306974,null,10.21853245488759,null,null,2.4640183730410932E-47,null,null,25.359223593191775,null,1.1387218336255316E-281,null,null,0,null,4.4184979940172391E-285,null,null,1.0406112877297279E+98,null,null,null,0,null,null,0,null,null,1.0012808049033479,null,null,1.2288968188323675E-47,null,1.2288968188323675E-45,null,3.6756634660988068E-45,null,3.6756634660988068E-45,null,3.6756634660988069E-48]
[null,1700,null,0.99747374636306974,null,10.521346277653674,null,null,4.4829852641566138E-50,null,null,25.662037415957858,null,2.1950546100398537E-288,null,null,0,null,7.7581050573864673E-292,null,null,1.0406112877297279E+98,null,null,null,0,null,null,0,null,null,1.0014062434641751,null,null,2.2358300531643666E-50,null,2.2358300531643665E-48,null,6.6874278758655044E-48,null,6.6874278758655044E-48,null,6.6874278758655047E-51]
[null,1720,null,0.99747374636306974,null,10.824160100419759,null,null,6.7950842422876904E-53,null,null,25.964851238723941,null,3.5227911457339618E-295,null,null,0,null,1.1340960073550711E-298,null,null,1.0406112877297279E+98,null,null,null,0,null,null,0,null,null,1.0015439671376696,null,null,3.3889590680036818E-53,null,3.3889590680036821E-51,null,1.013646780060922E-50,null,1.013646780060922E-50,null,1.013646780060922E-53]
[null,1740,null,0.99747374636306974,null,11.126973923185842,null,null,8.5804027792954232E-56,null,null,26.267665061490025,null,4.706964881106957E-302,null,null,0,null,1.3802437589909036E-305,null,null,1.0406112877297279E+98,null,null,null,0,null,null,0,null,null,1.0016951790944693,null,null,4.2793632527839511E-56,null,4.2793632527839513E-54,null,1.2799690686292977E-53,null,1.2799690686292977E-53,null,1.2799690686292978E-56]
[null,1760,null,0.99747374636306974,null,11.429787745951925,null,null,9.0258560760713813E-59,null,null,26.570478884256111,null,0,null,null,0,null,0,null,null,1.0406112877297279E+98,null,null,null,0,null,null,0,null,null,1.0018612003404832,null,null,4.5015272371663987E-59,null,4.501527237166399E-57,null,1.3464189144066997E-56,null,1.3464189144066997E-56,null,1.3464189144066998E-59]
[null,1780,null,0.99747374636306974,null,11.732601568718009,null,null,7.9089888159395886E-62,null,null,26.873292707022195,null,0,null,null,0,null,0,null,null,1.0406112877297279E+98,null,null,null,0,null,null,0,null,null,1.0020434812573591,null,null,3.9445043520894405E-62,null,3.9445043520894407E-60,null,1.179811870016782E-59,null,1.179811870016782E-59,null,1.1798118700167821E-62]
[null,1800,null,0.99747374636306974,null,12.035415391484094,null,null,5.7728526116211863E-65,null,null,27.176106529788278,null,0,null,null,0,null,0,null,null,1.0406112877297279E+98,null,null,null,0,null,null,0,null,null,1.0022436142731919,null,null,2.8791344608578079E-65,null,2.8791344608578081E-63,null,8.6115686765437936E-63,null,8.6115686765437936E-63,null,8.6115686765437946E-66]
[null,1820,null,0.99747374636306974,null,12.338229214250177,null,null,3.5098061508340584E-68,null,null,27.478920352554361,null,0,null,null,0,null,0,null,null,1.0406112877297279E+98,null,null,null,0,null,null,0,null,null,1.0024633477741685,null,null,1.7504697451402969E-68,null,1.7504697451402968E-66,null,5.2357021290337903E-66,null,5.2357021290337903E-66,null,5.235702129033791E-69]
[null,1840,null,0.99747374636306974,null,12.64104303701626,null,null,1.7774038860102892E-71,null,null,27.781734175320445,null,0,null,null,0,null,0,null,null,1.0406112877297279E+98,null,null,null,0,null,null,0,null,null,1.00270460137868,null,null,8.8645685648948086E-72,null,8.8645685648948092E-70,null,2.6514163205069221E-69,null,2.6514163205069221E-69,null,2.6514163205069223E-72]
[null,1860,null,0.99747374636306974,null,12.943856859782343,null,null,7.4970001952467538E-75,null,null,28.084547998086528,null,0,null,null,0,null,0,null,null,1.0406112877297279E+98,null,null,null,0,null,null,0,null,null,1.0029694827073399,null,null,3.7390304356187224E-75,null,3.7390304356187226E-73,null,1.1183540684801764E-72,null,1.1183540684801764E-72,null,1.1183540684801765E-75]
[null,1880,null,0.99747374636306974,null,13.246670682548428,null,null,2.6337600054409447E-78,null,null,28.387361820852611,null,0,null,null,0,null,0,null,null,1.0406112877297279E+98,null,null,null,0,null,null,0,null,null,1.0032603057954124,null,null,1.313553229824199E-78,null,1.3135532298241991E-76,null,3.9288730702618125E-76,null,3.9288730702618125E-76,null,3.9288730702618127E-79]
[null,1900,null,0.99747374636306974,null,13.549484505314512,null,null,7.7062264919014002E-82,null,null,28.690175643618694,null,0,null,null,0,null,0,null,null,1.0406112877297279E+98,null,null,null,0,null,null,0,null,null,1.0035796113085034,null,null,3.8433793045996131E-82,null,3.843379304599613E-80,null,1.1495650960916093E-79,null,1.1495650960916093E-79,null,1.1495650960916093E-82]
[null,1920,null,0.99747374636306974,null,13.852298328080595,null,null,1.8779089118737442E-85,null,null,28.992989466384781,null,0,null,null,0,null,0,null,null,1.0406112877297279E+98,null,null,null,0,null,null,0,null,null,1.0039301887381227,null,null,9.3658241882764979E-86,null,9.3658241882764986E-84,null,2.8013432268025421E-83,null,2.8013432268025421E-83,null,2.8013432268025424E-86]
[null,1940,null,{"$f":"EXP(-0.693/$M$6*$M$19)","v":0.99747374636306974},null,{"$f":"(B210-$M$13-($I$33*$M$19))/POWER(4*$T$33*$M$19,0.5)","v":14.155112150846678},null,null,{"$f":"IF(F210>0,ERFC(IF(F210<27,F210,27)),1+ERF(IF(-F210<27,-F210,27)))","v":3.8112318228787482E-89},null,null,{"$f":"(B210-($M$19*$I$33))/POWER(4*$T$33*$M$19,0.5)","v":29.295803289150864},null,{"$f":"IF(L210>0,ERFC(IF(L210<27,L210,27)),1+ERF(IF(-L210<27,-L210,27)))","v":0},null,null,{"$f":"IF((B210+$M$13+$I$33*$M$19)/POWER(4*$T$33*$M$19,0.5)>27,ERFC(27),ERFC((B210+$M$13+$I$33*$M$19)/POWER(4*$T$33*$M$19,0.5)))","v":0},null,{"$f":"IF((B210+$I$33*$M$19)/(POWER(4*$T$33*$M$19,0.5))>27,ERFC(27),ERFC((B210+$I$33*$M$19)/(POWER(4*$T$33*$M$19,0.5))))","v":0},null,null,{"$f":"(2+$I$33/$C$39)*EXP(IF(($C$39*($C$39+$I$33)*$M$19+($C$39+$I$33)*B210)/$T$33>225,225,($C$39*($C$39+$I$33)*$M$19+($C$39+$I$33)*B210)/$T$33))","v":1.0406112877297279E+98},null,null,null,{"$f":"IF((B210+((2*$C$39+$I$33)*$M$19))/POWER(4*$T$33*$M$19,0.5)>27,ERFC(27),ERFC((B210+((2*$C$39+$I$33)*$M$19))/POWER(4*$T$33*$M$19,0.5)))","v":0},null,null,{"$f":"IF((B210+$M$13+((2*$C$39+$I$33)*$M$19))/POWER(4*$T$33*$M$19,0.5)>27,ERFC(27),ERFC((B210+$M$13+((2*$C$39+$I$33)*$M$19))/POWER(4*$T$33*$M$19,0.5)))","v":0},null,null,1.0043151007710176,null,null,1.9008018423125083E-89,null,1.9008018423125082E-87,null,5.6853494785020198E-87,null,5.6853494785020198E-87,null,5.6853494785020201E-90]
[null,1960,null,0.99747374636306974,null,14.457925973612763,null,null,6.4417782514591204E-93,null,null,29.598617111916948,null,0,null,null,0,null,0,null,null,1.0406112877297279E+98,null,null,null,0,null,null,0,null,null,1.0047377100451749,null,null,3.2127523428615366E-93,null,3.2127523428615365E-91,null,9.6094287423575394E-91,null,9.6094287423575394E-91,null,9.60942874235754E-94]
[null,1980,null,0.99747374636306974,null,14.760739796378846,null,null,9.0675034578715516E-97,null,null,29.901430934683031,null,0,null,null,0,null,0,null,null,1.0406112877297279E+98,null,null,null,0,null,null,0,null,null,1.0052017085262315,null,null,4.5222983221416131E-97,null,4.5222983221416129E-95,null,1.3526316018369733E-94,null,1.3526316018369733E-94,null,1.3526316018369733E-97]
[null,2000,null,0.99747374636306974,null,15.06355361914493,null,null,1.0629276757805709E-100,null,null,30.204244757449114,null,0,null,null,0,null,0,null,null,1.0406112877297279E+98,null,null,null,0,null,null,0,null,null,1.005711149760933,null,null,5.3012122543691819E-101,null,5.3012122543691822E-99,null,1.5856068557435244E-98,null,1.5856068557435244E-98,null,1.5856068557435243E-101]
[null,2020,null,0.99747374636306974,null,15.366367441911013,null,null,1.037639844493491E-104,null,null,30.507058580215197,null,0,null,null,0,null,0,null,null,1.0406112877297279E+98,null,null,null,0,null,null,0,null,null,1.0062704842894059,null,null,5.1750925153125781E-105,null,5.1750925153125782E-103,null,1.547884102286913E-102,null,1.547884102286913E-102,null,1.5478841022869132E-105]
[null,2040,null,0.99747374636306974,null,15.669181264677096,null,null,8.4354805045168849E-109,null,null,30.809872402981281,null,0,null,null,0,null,0,null,null,1.0406112877297279E+98,null,null,null,0,null,null,0,null,null,1.0068845985256154,null,null,4.2070851706065472E-109,null,4.2070851706065469E-107,null,1.2583504996829156E-106,null,1.2583504996829156E-106,null,1.2583504996829157E-109]
[null,2060,null,0.99747374636306974,null,15.97199508744318,null,null,5.7106687880318446E-113,null,null,31.112686225747364,null,0,null,null,0,null,0,null,null,1.0406112877297279E+98,null,null,null,0,null,null,0,null,null,1.0075588574456655,null,null,2.8481210951183873E-113,null,2.8481210951183872E-111,null,8.5188068647608809E-111,null,8.5188068647608809E-111,null,8.5188068647608818E-114]
[null,2080,null,0.99747374636306974,null,16.274808910209263,null,null,3.2193791518130205E-117,null,null,31.415500048513451,null,0,null,null,0,null,0,null,null,1.0406112877297279E+98,null,null,null,0,null,null,0,null,null,1.00829915145688,null,null,1.6056230917610476E-117,null,1.6056230917610475E-115,null,4.8024618896143012E-115,null,4.8024618896143012E-115,null,4.8024618896143011E-118]
[null,2100,null,0.99747374636306974,null,16.577622732975346,null,null,1.5113312547013338E-121,null,null,31.718313871279534,null,0,null,null,0,null,0,null,null,1.0406112877297279E+98,null,null,null,0,null,null,0,null,null,1.0091119478571098,null,null,7.5375662431126909E-122,null,7.5375662431126915E-120,null,2.254506353872191E-119,null,2.254506353872191E-119,null,2.2545063538721912E-122]
[null,2120,null,0.99747374636306974,null,16.880436555741429,null,null,5.9080512734194947E-126,null,null,32.021127694045617,null,0,null,null,0,null,0,null,null,1.0406112877297279E+98,null,null,null,0,null,null,0,null,null,1.0100043473338303,null,null,2.946563018701424E-126,null,2.9465630187014242E-124,null,8.8132493081797339E-124,null,8.8132493081797339E-124,null,8.8132493081797356E-127]
[null,2140,null,0.99747374636306974,null,17.183250378507516,null,null,1.9231840891858767E-130,null,null,32.323941516811701,null,0,null,null,0,null,0,null,null,1.0406112877297279E+98,null,null,null,0,null,null,0,null,null,1.0109841459966016,null,null,9.5916281919304231E-131,null,9.5916281919304231E-129,null,2.8688818121426995E-128,null,2.8688818121426995E-128,null,2.8688818121426995E-131]
[null,2160,null,0.99747374636306974,null,17.486064201273599,null,null,5.2129634961136464E-135,null,null,32.626755339577784,null,0,null,null,0,null,0,null,null,1.0406112877297279E+98,null,null,null,0,null,null,0,null,null,1.0120599034848248,null,null,2.5998971140612023E-135,null,2.5998971140612023E-133,null,7.7763622554173566E-133,null,7.7763622554173566E-133,null,7.776362255417357E-136]
[null,2180,null,0.99747374636306974,null,17.788878024039683,null,null,1.1766063649388674E-139,null,null,32.929569162343867,null,0,null,null,0,null,0,null,null,1.0406112877297279E+98,null,null,null,0,null,null,0,null,null,1.0132410177457847,null,null,5.8681697941510264E-140,null,5.868169794151026E-138,null,1.7551853820990113E-137,null,1.7551853820990113E-137,null,1.7551853820990112E-140]
[null,2200,null,0.99747374636306974,null,18.091691846805766,null,null,2.2113428003854784E-144,null,null,33.23238298510995,null,0,null,null,0,null,0,null,null,1.0406112877297279E+98,null,null,null,0,null,null,0,null,null,1.014537807136251,null,null,1.1028781937967525E-144,null,1.1028781937967525E-142,null,3.2987383662913836E-142,null,3.2987383662913836E-142,null,3.2987383662913844E-145]
[null,2220,null,0.99747374636306974,null,18.394505669571849,null,null,3.4606303843597507E-149,null,null,33.535196807876034,null,0,null,null,0,null,0,null,null,1.0406112877297279E+98,null,null,null,0,null,null,0,null,null,1.0159616005648897,null,null,1.7259439771325953E-149,null,1.7259439771325953E-147,null,5.1623448967076636E-147,null,5.1623448967076636E-147,null,5.1623448967076643E-150]
[null,2240,null,0.99747374636306974,null,18.697319492337932,null,null,4.5094619241489017E-154,null,null,33.838010630642117,null,0,null,null,0,null,0,null,null,1.0406112877297279E+98,null,null,null,0,null,null,0,null,null,1.0175248364629761,null,null,2.2490349397812111E-154,null,2.2490349397812111E-152,null,6.7269240472020289E-152,null,6.7269240472020289E-152,null,6.7269240472020291E-155]
[null,2260,null,0.99747374636306974,null,19.000133315104016,null,null,4.8928384579383205E-159,null,null,34.1408244534082,null,0,null,null,0,null,0,null,null,1.0406112877297279E+98,null,null,null,0,null,null,0,null,null,1.0192411714480327,null,null,2.4402389534945206E-159,null,2.4402389534945206E-157,null,7.2988203992857063E-157,null,7.2988203992857063E-157,null,7.2988203992857071E-160]
[null,2280,null,0.99747374636306974,null,19.302947137870099,null,null,4.4203853661773834E-164,null,null,34.443638276174283,null,0,null,null,0,null,0,null,null,1.0406112877297279E+98,null,null,null,0,null,null,0,null,null,1.021125599629688,null,null,2.2046091757847222E-164,null,2.2046091757847222E-162,null,6.594045391180626E-162,null,6.594045391180626E-162,null,6.5940453911806267E-165]
[null,2300,null,0.99747374636306974,null,19.605760960636186,null,null,3.3252102485541057E-169,null,null,34.746452098940367,null,0,null,null,0,null,0,null,null,1.0406112877297279E+98,null,null,null,0,null,null,0,null,null,1.023194583600028,null,null,1.6584049620350691E-169,null,1.658404962035069E-167,null,4.9603338844518524E-167,null,4.9603338844518524E-167,null,4.9603338844518529E-170]
[null,2320,null,0.99747374636306974,null,19.908574783402269,null,null,2.0827377331626818E-174,null,null,35.049265921706457,null,0,null,null,0,null,0,null,null,1.0406112877297279E+98,null,null,null,0,null,null,0,null,null,1.0254661982527897,null,null,1.0387381046947539E-174,null,1.038738104694754E-172,null,3.1068936331847079E-172,null,3.1068936331847079E-172,null,3.1068936331847085E-175]
[null,2340,null,0.99747374636306974,null,20.211388606168352,null,null,1.0861841875994921E-179,null,null,35.35207974447254,null,0,null,null,0,null,0,null,null,1.0406112877297279E+98,null,null,null,0,null,null,0,null,null,1.0279602886878125,null,null,5.4172010542259636E-180,null,5.4172010542259631E-178,null,1.6202994180137482E-177,null,1.6202994180137482E-177,null,1.6202994180137483E-180]
[null,2360,null,0.99747374636306974,null,20.514202428934436,null,null,4.7165325736490981E-185,null,null,35.654893567238624,null,0,null,null,0,null,0,null,null,1.0406112877297279E+98,null,null,null,0,null,null,0,null,null,1.0306986435802283,null,null,2.3523087080406085E-185,null,2.3523087080406085E-183,null,7.0358186681174745E-183,null,7.0358186681174745E-183,null,7.0358186681174747E-186]
[null,2380,null,0.99747374636306974,null,20.817016251700519,null,null,1.7052570533938502E-190,null,null,35.957707390004707,null,0,null,null,0,null,0,null,null,1.0406112877297279E+98,null,null,null,0,null,null,0,null,null,1.0337051855289558,null,null,8.5047457078040652E-191,null,8.5047457078040648E-189,null,2.5437923353352145E-188,null,2.5437923353352145E-188,null,2.5437923353352146E-191]
[null,2400,null,0.99747374636306974,null,21.119830074466602,null,null,5.1333612705891105E-196,null,null,36.26052121277079,null,0,null,null,0,null,0,null,null,1.0406112877297279E+98,null,null,null,0,null,null,0,null,null,1.0370061800474144,null,null,2.5601965490048041E-196,null,2.560196549004804E-194,null,7.6576167966245405E-194,null,7.6576167966245405E-194,null,7.6576167966245402E-197]
[null,2420,null,0.99747374636306974,null,21.422643897232685,null,null,1.2866374312100464E-201,null,null,36.563335035536873,null,0,null,null,0,null,0,null,null,1.0406112877297279E+98,null,null,null,0,null,null,0,null,null,1.0406304650222196,null,null,6.4169352936002075E-202,null,6.4169352936002072E-200,null,1.9193226202194043E-199,null,1.9193226202194043E-199,null,1.9193226202194046E-202]
[null,2440,null,0.99747374636306974,null,21.725457719998769,null,null,2.6850380050734133E-207,null,null,36.866148858302957,null,0,null,null,0,null,0,null,null,1.0406112877297279E+98,null,null,null,0,null,null,0,null,null,1.044609702644441,null,null,1.3391274590239003E-207,null,1.3391274590239004E-205,null,4.0053662782369902E-205,null,4.0053662782369902E-205,null,4.0053662782369909E-208]
[null,2460,null,0.99747374636306974,null,22.028271542764855,null,null,4.6653284431204175E-213,null,null,37.16896268106904,null,0,null,null,0,null,0,null,null,1.0406112877297279E+98,null,null,null,0,null,null,0,null,null,1.048978656014327,null,null,2.326771320086755E-213,null,2.3267713200867549E-211,null,6.9594356533003648E-211,null,6.9594356533003648E-211,null,6.9594356533003655E-214]
[null,2480,null,0.99747374636306974,null,22.331085365530939,null,null,6.7491528845664348E-219,null,null,37.471776503835123,null,0,null,null,0,null,0,null,null,1.0406112877297279E+98,null,null,null,0,null,null,0,null,null,1.0537754928359453,null,null,3.3660514062728004E-219,null,3.3660514062728005E-217,null,1.0067950367715257E-216,null,1.0067950367715257E-216,null,1.0067950367715258E-219]
[null,2500,null,0.99747374636306974,null,22.633899188297022,null,null,8.1292294059624925E-225,null,null,37.774590326601206,null,0,null,null,0,null,0,null,null,1.0406112877297279E+98,null,null,null,0,null,null,0,null,null,1.059042118854852,null,null,4.0543464553051198E-225,null,4.0543464553051195E-223,null,1.2126659387752105E-222,null,1.2126659387752105E-222,null,1.2126659387752106E-225]
[null,2520,null,0.99747374636306974,null,22.936713011063105,null,null,8.1523058754053981E-231,null,null,38.07740414936729,null,0,null,null,0,null,0,null,null,1.0406112877297279E+98,null,null,null,0,null,null,0,null,null,1.0648245439517443,null,null,4.0658555415191439E-231,null,4.0658555415191443E-229,null,1.2161083374434132E-228,null,1.2161083374434132E-228,null,1.2161083374434133E-231]
[null,2540,null,0.99747374636306974,null,23.239526833829188,null,null,6.8067611252431416E-237,null,null,38.380217972133373,null,0,null,null,0,null,0,null,null,1.0406112877297279E+98,null,null,null,0,null,null,0,null,null,1.0711732840903341,null,null,3.3947827600973901E-237,null,3.3947827600973905E-235,null,1.015388662043088E-234,null,1.015388662043088E-234,null,1.0153886620430881E-237]
[null,2560,null,0.99747374636306974,null,23.542340656595272,null,null,4.7318129930462387E-243,null,null,38.683031794899456,null,0,null,null,0,null,0,null,null,1.0406112877297279E+98,null,null,null,0,null,null,0,null,null,1.0781438026309027,null,null,2.3599296166316408E-243,null,2.3599296166316407E-241,null,7.0586130108623371E-241,null,7.0586130108623371E-241,null,7.0586130108623369E-244]
[null,2580,null,{"$f":"EXP(-0.693/$M$6*$M$19)","v":0.99747374636306974},null,{"$f":"(B242-$M$13-($I$33*$M$19))/POWER(4*$T$33*$M$19,0.5)","v":23.845154479361355},null,null,{"$f":"IF(F242>0,ERFC(IF(F242<27,F242,27)),1+ERF(IF(-F242<27,-F242,27)))","v":2.7386705352743225E-249},null,null,{"$f":"(B242-($M$19*$I$33))/POWER(4*$T$33*$M$19,0.5)","v":38.985845617665539},null,{"$f":"IF(L242>0,ERFC(IF(L242<27,L242,27)),1+ERF(IF(-L242<27,-L242,27)))","v":0},null,null,{"$f":"IF((B242+$M$13+$I$33*$M$19)/POWER(4*$T$33*$M$19,0.5)>27,ERFC(27),ERFC((B242+$M$13+$I$33*$M$19)/POWER(4*$T$33*$M$19,0.5)))","v":0},null,{"$f":"IF((B242+$I$33*$M$19)/(POWER(4*$T$33*$M$19,0.5))>27,ERFC(27),ERFC((B242+$I$33*$M$19)/(POWER(4*$T$33*$M$19,0.5))))","v":0},null,null,{"$f":"(2+$I$33/$C$39)*EXP(IF(($C$39*($C$39+$I$33)*$M$19+($C$39+$I$33)*B242)/$T$33>225,225,($C$39*($C$39+$I$33)*$M$19+($C$39+$I$33)*B242)/$T$33))","v":1.0406112877297279E+98},null,null,null,{"$f":"IF((B242+((2*$C$39+$I$33)*$M$19))/POWER(4*$T$33*$M$19,0.5)>27,ERFC(27),ERFC((B242+((2*$C$39+$I$33)*$M$19))/POWER(4*$T$33*$M$19,0.5)))","v":0},null,null,{"$f":"IF((B242+$M$13+((2*$C$39+$I$33)*$M$19))/POWER(4*$T$33*$M$19,0.5)>27,ERFC(27),ERFC((B242+$M$13+((2*$C$39+$I$33)*$M$19))/POWER(4*$T$33*$M$19,0.5)))","v":0},null,null,1.0857969948649144,null,null,1.365875979437116E-249,null,1.365875979437116E-247,null,4.0853718228428199E-247,null,4.0853718228428199E-247,null,4.0853718228428204E-250]
[null,2600,null,0.99747374636306974,null,24.147968302127438,null,null,1.3197004539693529E-255,null,null,39.288659440431623,null,0,null,null,0,null,0,null,null,1.0406112877297279E+98,null,null,null,0,null,null,0,null,null,{"$f":"1+($I$33/$C$39)*EXP($I$33*B243/$T$33)","v":1.0941997200036324},null,null,{"$f":"0.5*D243*((I243-N243)+(AF243)*(Q243-S243)+V243*(Z243-($R$81*AC243)))","v":6.5818327794892711E-256},null,{"$f":"$M$4*AI243","v":6.581832779489271E-254},null,{"$f":"AI243*$M$25","v":1.9686439021403607E-253},null,{"$f":"AI243*$M$26","v":1.9686439021403607E-253},null,{"$f":"AI243*$M$27","v":1.9686439021403606E-256}]
[null,{"$f":"B243+$M$17/150","v":2620},null,0.99747374636306974,null,24.450782124893525,null,null,5.2945929236906964E-262,null,null,39.591473263197713,null,0,null,null,0,null,0,null,null,1.0406112877297279E+98,null,null,null,0,null,null,0,null,null,1.1034253852682605,null,null,2.6406087195305788E-262,null,2.6406087195305788E-260,null,7.8981317633018329E-260,null,7.8981317633018329E-260,null,7.8981317633018327E-263]
[null,2640,null,0.99747374636306974,null,24.753595947659608,null,null,1.7685190865436082E-268,null,null,39.894287085963796,null,0,null,null,0,null,0,null,null,1.0406112877297279E+98,null,null,null,0,null,null,0,null,null,1.1135545871842893,null,null,8.8202567938462343E-269,null,8.8202567938462335E-267,null,2.6381625505023636E-266,null,2.6381625505023636E-266,null,2.638162550502364E-269]
[null,2660,null,0.99747374636306974,null,25.056409770425692,null,null,4.918189871858028E-275,null,null,40.19710090872988,null,0,null,null,0,null,0,null,null,1.0406112877297279E+98,null,null,null,0,null,null,0,null,null,1.1246758156824728,null,null,2.4528826384035666E-275,null,2.4528826384035667E-273,null,7.33663800120708E-273,null,7.33663800120708E-273,null,7.3366380012070807E-276]
[null,2680,null,0.99747374636306974,null,25.359223593191775,null,null,1.1387218336255316E-281,null,null,40.499914731495963,null,0,null,null,0,null,0,null,null,1.0406112877297279E+98,null,null,null,0,null,null,0,null,null,1.1368862271575451,null,null,5.6792256672594155E-282,null,5.6792256672594151E-280,null,1.6986716851224576E-279,null,1.6986716851224576E-279,null,1.6986716851224578E-282]
[null,2700,null,0.99747374636306974,null,25.662037415957858,null,null,2.1950546100398537E-288,null,null,40.802728554262046,null,0,null,null,0,null,0,null,null,1.0406112877297279E+98,null,null,null,0,null,null,0,null,null,1.1502924932382155,null,null,1.09475467267399E-288,null,1.09475467267399E-286,null,3.2744406959341683E-286,null,3.2744406959341683E-286,null,3.2744406959341684E-289]
[null,2720,null,0.99747374636306974,null,25.964851238723941,null,null,3.5227911457339618E-295,null,null,41.105542377028129,null,0,null,null,0,null,0,null,null,1.0406112877297279E+98,null,null,null,0,null,null,0,null,null,1.1650117326833931,null,null,1.7569458408949528E-295,null,1.7569458408949528E-293,null,5.2550723057675569E-293,null,5.2550723057675569E-293,null,5.2550723057675568E-296]
[null,2740,null,0.99747374636306974,null,26.267665061490025,null,null,4.706964881106957E-302,null,null,41.408356199794213,null,0,null,null,0,null,0,null,null,1.0406112877297279E+98,null,null,null,0,null,null,0,null,null,1.181172534545804,null,null,2.3475369469785786E-302,null,2.3475369469785784E-300,null,7.0215462023287513E-300,null,7.0215462023287513E-300,null,7.0215462023287516E-303]
[null,2760,null,0.99747374636306974,null,26.570478884256111,null,null,0,null,null,41.711170022560296,null,0,null,null,0,null,0,null,null,1.0406112877297279E+98,null,null,null,0,null,null,0,null,null,1.1989160815414788,null,null,0,null,0,null,0,null,0,null,0]
[null,2780,null,0.99747374636306974,null,26.873292707022195,null,null,0,null,null,42.013983845326379,null,0,null,null,0,null,0,null,null,1.0406112877297279E+98,null,null,null,0,null,null,0,null,null,1.2183973834390045,null,null,0,null,0,null,0,null,0,null,0]
[null,2800,null,0.99747374636306974,null,27.176106529788278,null,null,0,null,null,42.316797668092462,null,0,null,null,0,null,0,null,null,1.0406112877297279E+98,null,null,null,0,null,null,0,null,null,1.2397866312435752,null,null,0,null,0,null,0,null,0,null,0]
[null,2820,null,0.99747374636306974,null,27.478920352554361,null,null,0,null,null,42.619611490858546,null,0,null,null,0,null,0,null,null,1.0406112877297279E+98,null,null,null,0,null,null,0,null,null,1.2632706840061603,null,null,0,null,0,null,0,null,0,null,0]
[null,2840,null,0.99747374636306974,null,27.781734175320445,null,null,0,null,null,42.922425313624629,null,0,null,null,0,null,0,null,null,1.0406112877297279E+98,null,null,null,0,null,null,0,null,null,1.2890547012467302,null,null,0,null,0,null,0,null,0,null,0]
[null,2860,null,0.99747374636306974,null,28.084547998086528,null,null,0,null,null,43.225239136390712,null,0,null,null,0,null,0,null,null,1.0406112877297279E+98,null,null,null,0,null,null,0,null,null,1.3173639352525912,null,null,0,null,0,null,0,null,0,null,0]
[null,2880,null,0.99747374636306974,null,28.387361820852611,null,null,0,null,null,43.528052959156796,null,0,null,null,0,null,0,null,null,1.0406112877297279E+98,null,null,null,0,null,null,0,null,null,1.3484456989095599,null,null,0,null,0,null,0,null,0,null,0]
[null,2900,null,0.99747374636306974,null,28.690175643618694,null,null,0,null,null,43.830866781922879,null,0,null,null,0,null,0,null,null,1.0406112877297279E+98,null,null,null,0,null,null,0,null,null,1.3825715262571898,null,null,0,null,0,null,0,null,0,null,0]
[null,2920,null,0.99747374636306974,null,28.992989466384781,null,null,0,null,null,44.133680604688962,null,0,null,null,0,null,0,null,null,1.0406112877297279E+98,null,null,null,0,null,null,0,null,null,1.4200395446429199,null,null,0,null,0,null,0,null,0,null,0]
[null,2940,null,0.99747374636306974,null,29.295803289150864,null,null,0,null,null,44.436494427455052,null,0,null,null,0,null,0,null,null,1.0406112877297279E+98,null,null,null,0,null,null,0,null,null,1.4611770791985743,null,null,0,null,0,null,0,null,0,null,0]
[null,2960,null,0.99747374636306974,null,29.598617111916948,null,null,0,null,null,44.739308250221136,null,0,null,null,0,null,0,null,null,1.0406112877297279E+98,null,null,null,0,null,null,0,null,null,1.506343512392228,null,null,0,null,0,null,0,null,0,null,0]
[null,2980,null,0.99747374636306974,null,29.901430934683031,null,null,0,null,null,45.042122072987219,null,0,null,null,0,null,0,null,null,1.0406112877297279E+98,null,null,null,0,null,null,0,null,null,1.5559334236368327,null,null,0,null,0,null,0,null,0,null,0]
[null,3000,null,0.99747374636306974,null,30.204244757449114,null,null,0,null,null,45.344935895753302,null,0,null,null,0,null,0,null,null,1.0406112877297279E+98,null,null,null,0,null,null,0,null,null,1.6103800363836047,null,null,0,null,0,null,0,null,0,null,0]

{"sheet":"OutputJury 2","index":11,"n_rows":90,"n_cols":6,"rows_kept":90,"cut":false,"hidden":true,"merged":[]}
["2008-02-27"]
[]
[null,null,null,null,"Solution of Jury 2 equation with time fixed and depth varies"]
[]
[]
[null,null,null,null,null,{"$f":"IF('Alt-GPL Calc for VOCs'!$I$13>IntercalsJury1!$M$30*1000,\"Warning: Input soil concentration exceeds maximum allowed\",\" \")","v":" "}]
[]
[]
[]
[]
[]
[]
[]
[]
[]
[]
[]
[]
[]
[]
[]
[]
[]
[]
[]
[]
[null,null,null,null,null,{"$f":"IF('Alt-GPL Calc for VOCs'!$I$13>IntercalsJury1!$M$30*1000,\"Warning: Input soil concentration exceeds maximum allowed\",\" \")","v":" "}]
[]
[]
[]
[]
[]
[]
[]
[]
[]
[]
[]
[]
[]
[]
[]
[]
[]
[]
[]
[null,null,null,null,null,{"$f":"IF('Alt-GPL Calc for VOCs'!$I$13>IntercalsJury1!$M$30*1000,\"Warning: Input soil concentration exceeds maximum allowed\",\" \")","v":" "}]
[]
[]
[]
[]
[]
[]
[]
[]
[]
[]
[]
[]
[]
[]
[]
[]
[]
[]
[]
[]
[null,null,null,null,null,{"$f":"IF('Alt-GPL Calc for VOCs'!$I$13>IntercalsJury1!$M$30*1000,\"Warning: Input soil concentration exceeds maximum allowed\",\" \")","v":" "}]
[]
[]
[]
[]
[]
[]
[]
[]
[]
[]
[]
[]
[]
[]
[]
[]
[]
[]
[]
[]
[]
[null,null,null,null,null,{"$f":"IF('Alt-GPL Calc for VOCs'!$I$13>IntercalsJury1!$M$30*1000,\"Warning: Input soil concentration exceeds maximum allowed\",\" \")","v":" "}]