{"text_format":"1","workbook":"xlsx","n_sheets":12,"sheets":["Instructions","Minimum GPL for VOCs","Default GPL Metals","Alt-GPL Calc for VOCs","Alt-GPL Calc for Metals","Soil Phase Partitioning Calc","Lookup Table","IntercalsJury1","OutputJury1","GPL","IntercalcsJury2","OutputJury 2"],"not_rendered":{"charts":10,"images":2,"macros":1,"external_links":0,"defined_names":12,"comments":0,"pivot_tables":0},"unopened":[],"bounds":{"document_bytes":16777216,"sheet_cells":100000,"rows_first":2000,"rows_last":500,"rows_between":2000,"halvings":0,"cell_chars":16384,"cell_head_chars":4096},"cells_cut":0,"cells_raw":0,"read":"whole","date_system":"1900"}

{"sheet":"Instructions","index":0,"n_rows":95,"n_cols":2,"rows_kept":95,"cut":false,"hidden":false,"merged":[[174,7,184,7],[174,8,184,8],[174,9,184,9],[174,2,184,2],[174,3,184,3],[174,4,184,4],[174,5,184,5],[174,6,184,6],[174,14,184,14],[174,10,184,10],[174,11,184,11],[174,12,184,12],[174,13,184,13]]}
["2020-11-18"]
[null,"I.  Introduction"]
[]
[null,"The following presents brief instructions for understanding and operating the various worksheets. The primary goal is to accurately reproduce the GPL model in a spreadsheet form. However, an additional tool is included to calculate soil equilibrium concentrations. The document A Screening Method to Determine Soil Concentrations Protective of Groundwater Quality, September 1996 should be consulted for additional information."]
[]
[null,"Minimum GPL for VOCs:  This table shows the minimum GPLs using the revised 2007 chemical properties."]
[]
[null,"Default GPL Metals:  This table shows default metals GPLs per ADEQ’s Guidance: A Screening Method to Determine Soil Concentrations Protective of Groundwater Quality, September 1996 (Table 4, page 35). "]
[]
[null,"Alt-GPL Calc for VOCs:  The input and output worksheet to calculate alternative GPLs for VOCs. Drop down boxes are provided to enter chemical (cell K6) and soil (cell K15) type. The selection made from these drop down boxes affects certain chemical and soil parameters (cells K7-10, K16-18). Selecting a listed chemical and/or soil will cause a GPL to be calculated using the parameters included on the Lookup Table worksheet. Selecting \"Enter Chemical Properties\" and/or \"New Soil Type\" will cause a GPL to be calculated using data entered by the user on the Alt-GPL Calc for VOCs worksheet. Upon selecting the button “Run GPL”, a dialog box will appear. The dialog box contains check box 1 to use minimum GPL default values (cells K19 through K31) and check boxes 2 and 3 to use default chemical half-life values (cells K11, K12). Selecting any of these check boxes will overwrite user-entered values."]
[]
[null,"Alt-GPL Calc for Metals:  The input and output worksheet to calculate alternative GPLs for metals. The concentration of a metal found in soil is entered into the cell below the respective metal’s name. An associated SPLP or TCLP concentration is entered into the cell immediately to the right of the cell where the user entered a metal concentration."]
[]
[null,"Soil Phase Partitioning Calc:  The input and output worksheet to calculate equilibrium soil gas, liquid, and total soil contaminant concentrations. Drop down boxes are provided to enter chemical (cell G14) and soil (cell G21) type. The selection made from these drop down boxes affects certain chemical and soil parameters (cells H17-19, H23-25). Selecting a listed chemical and/or soil will cause equilibrium concentrations to be calculated using the parameters included on the Lookup Table worksheet. Selecting \"Enter Chemical Properties\" and/or \"New Soil Type\" will cause equilibrium concentrations to be calculated using data entered by the user on the Soil Phase Partitioning Calc worksheet. Upon selecting the button “Calculate Soil Phase Concentrations”, a dialog box will appear. The dialog box requires the user to input a chemical concentration and select the phase which the concentration represents. Additionally the dialog box offers the option of using the GPL default value for the fraction of organic carbon (foc, cell H16) in the soil from which the concentration was determined."]
[]
[null,"Lookup Table:  Details the chemical and soil data used when a chemical or soil type is selected from a drop down box on the Soil Phase Partitioning Calc or Alt-GPL Calc for VOCs worksheets."]
[]
[]
[null,"II.  Calculating a GPL"]
[]
{"$rows_left_out":76}
{"sheet":"Minimum GPL for VOCs","index":1,"n_rows":39,"n_cols":5,"rows_kept":39,"cut":false,"hidden":false,"merged":[]}
["2008-11-01"]
[]
[]
[null,"Saturation Concentrations and Minimum GPLs"]
[]
[]
[null,"Compound","Spreadsheet Min.","1996 Min. GPL","Saturation "]
[null,null,"GPL (mg/kg)","(mg/kg)","(mg/kg)"]
[null,null,"(2007 chemical properties)","(1996 chemical properties)","(2007 chemical properties)"]
[null,null,"( foc = .001, θw=.15, Φ=.25)","( foc = .001, θw=.15, n=.25)","( foc = .001, θw=.15, n=.25)"]
[null,"Benzene",0.7,0.71,313.38]
[null,"Carbon tetrachloride",0.95,1.6,282.29333333333335]
[null,"Chlorobenzene",16.5,22,154.69266666666667]
[null,"o-dichlorobenzene","116*",72,116.03413333333332]
[null,"p-dichlorobenzene",27,9.3000000000000007,53.773333333333326]
[null,"1,2-Dichloroethane (DCA)",0.23,0.21,1020.6233333333333]
[null,"1,1-Dichloroethylene(DCE)",0.85,0.81,529.53666666666675]
[null,"cis-1,2-Dichloroethylene",5.3,4.9000000000000004,513.2166666666667]
[null,"trans-1,2-Dichloroethylene",9.1999999999999993,8.4,1122.45]
[null,"1,2-Dichloropropane",0.36,0.28000000000000003,423.82666666666671]
{"$rows_left_out":20}
{"sheet":"Default GPL Metals","index":2,"n_rows":14,"n_cols":2,"rows_kept":14,"cut":false,"hidden":false,"merged":[[0,0,0,1],[13,0,15,1]]}
["Default GPL - Metals\nmilligrams per kilogram (mg/Kg) "]
["Antimony",35]
["Arsenic",290]
["Barium",12000]
["Beryllium",23]
["Cadmium",29]
["Chromium, unspeciated",590]
["Lead",290]
["Mercury",12]
["Nickel",590]
["Selenium",290]
["Thallium",12]
[]
["For more information, refer to the ADEQ September 1996 Guidance: A Screening Method to Determine Soil Concentrations Protective of Groundwater Quality(Table 4, page 35)"]

{"sheet":"Alt-GPL Calc for VOCs","index":3,"n_rows":52,"n_cols":33,"rows_kept":52,"cut":false,"hidden":false,"merged":[[91,12,91,17],[106,47,106,52],[50,3,50,4],[1,8,1,10],[68,26,68,31],[49,3,49,4],[37,47,37,52],[38,6,40,11],[36,6,36,11],[37,6,37,11],[41,6,42,11],[44,25,44,26],[43,25,43,26],[34,28,34,29],[34,30,34,31],[30,27,30,31],[42,25,42,26],[41,25,41,31]]}
["2020-11-18"]
[]
[null,null,null,null,null,null,"*The Mixing Cell Diagram at the right of the Input Field visually depicts measurements."]
[null,null,null,null,null,null,"Input Field",null,null,null,null,null,null,null,"Mixing Cell Diagram -- conventional units (autofills)"]
[null,null,"Model Input Descriptions",null,null,null,"Parameter","Min GPL Default","Model Calculation Values","Modeled  Value : Custom /Default","Enter User Data","units"]
["Select chemical name from drop down list",null,null,null,null,null,"Compound",null,null,null,"Enter chemical properties",null,null,null,null,null,null,null,null,"Sc = distance from vadose impact to"]
["Kh = Henry's Constant (dimensionless)",null,null,null,null,null,"Kh","-",{"$f":"VLOOKUP(K$6,'Lookup Table'!A9:J79,3)","v":1},{"$f":"IF(K$6=\"Enter chemical properties\",\"C\",\"D\")","v":"C"},1,"ratio",null,null,null,null,null,null,null,"groundwater compliance point (m)",null,null,null,null,"w = release width (m)"]
["S = water solubility (mg/l)",null,null,null,null,null,"S","-",{"$f":"VLOOKUP($K$6,'Lookup Table'!A8:J79,4)","v":1},{"$f":"IF(K$6=\"Enter chemical properties\",\"C\",\"D\")","v":"C"},1,"mg/L",null,null,null,null,null,null,null,null,{"$f":"AC38","v":30.5},null,null,null,null,{"$f":"AC39","v":10}]
["Koc = soil distribution coefficient (L/Kg)",null,null,null,null,null,"Koc","-",{"$f":"VLOOKUP($K$6,'Lookup Table'!A8:J79,2)","v":1},"C",1,"L/kg"]
["WQS = Water Quality Standard (ug/l)- see help cells in Columns G & H",null,null,null,null,null,"WQS","-",{"$f":"IF(VLOOKUP(K$6,'Lookup Table'!A8:J79,5) =0,IF( VLOOKUP(K$6,'Lookup Table'!A8:J79,6) =0, 'Alt-GPL Calc for VOCs'!$K10, VLOOKUP(K$6,'Lookup Table'!A8:J79,6)), VLOOKUP(K$6,'Lookup Table'!A8:L79,5))","v":1},"C",1,"ug/L"]
["T1/2 V = vadose zone half life (d)",null,null,null,null,null,"T1/2 V","1,000/100,000",{"$f":"$K$11","v":100000},{"$f":"IF(OR(I11=1000,I11=100000),(\"D\"),(\"C\"))","v":"D"},100000,"day",null,null,null,null,null,null,null,null,null,null,null,null,null,null,null,null,{"$f":"AC36","v":1000},"L = depth of"]
["T1/2 GW = groundwater  half life (d)",null,null,null,null,null,"T1/2 GW","1,000/100,000",{"$f":"$K$12","v":100000},{"$f":"IF(OR(I12=1000,I12=100000),(\"D\"),(\"C\"))","v":"D"},100000,"day",null,null,"Z = groundwater ",null,{"$f":"AC37","v":1000},null,null,null,null,null,null,null,null,null,null,null,null,"incorporation (cm)"]
["Ct = initial total soil contaminant concentration (ug/kg, [ug/kg = (ug/l)/Pb])",null,null,null,null,null,"Ct (Co)","-",{"$f":"$K$13","v":100},"C",100,"ug/kg"]
[null,null,null,null,null,null,null,null,null,null,null,null,null,null,"or vadose zone depth"]
["Select Soil Type from drop down list",null,null,null,null,null,"Soil",null,null,null,"New Soil Type",null,null,null,"of interest (cm)",null,null,null,null,null,null,"▼",null,null,null,null,null,null," "]
["Φ = total porosity",null,null,null,null,null,"Φ",0.25,{"$f":"VLOOKUP($K$15,'Lookup Table'!B99:F109,3)","v":0.5},{"$f":"IF(K$15=\"New Soil Type\",\"C\",\"D\")","v":"C"},0.5,"ratio"]
["Pb = dry bulk density (g/cm3)",null,null,null,null,null,"Pb",1.5,{"$f":"VLOOKUP($K$15,'Lookup Table'!B99:F109,4)","v":1.5},{"$f":"IF(K$15=\"New Soil Type\",\"C\",\"D\")","v":"C"},1.5,"g/cm3",null,null,null,null,null,null,null,null,null,null,null,null,null,null,null,"d1"]
["θ = moisture content (vol/vol)",null,null,null,null,null,"θ",0.15,{"$f":"VLOOKUP($K$15,'Lookup Table'!B99:F109,5)","v":0.45},"C",0.45,"ratio",null,null,null,null,null,null,null,null,null,null,null,null,null,null,null,null,"d = mixing cell"]
["foc V = fraction of organic carbon in vadose zone",null,null,null,null,null,"foc V",1E-3,{"$f":"$K$19","v":1E-3},{"$f":"IF(I19=H19,(\"D\"),(\"C\"))","v":"D"},1E-3,"ratio",null,null,null,null,null,null,null,null,null,null,null,null,null,null,null,null,"depth (centimeters)"]
["foc A = fraction of organic carbon in aquifer",null,null,null,null,null,"foc A",1E-3,{"$f":"$K$20","v":1E-3},{"$f":"IF(I20=H20,(\"D\"),(\"C\"))","v":"D"},1E-3,"ratio"]
{"$rows_left_out":33}
{"sheet":"Alt-GPL Calc for Metals","index":4,"n_rows":30,"n_cols":15,"rows_kept":30,"cut":false,"hidden":false,"merged":[[0,0,0,14],[3,1,3,2],[3,3,3,4],[3,5,3,6],[3,7,3,8],[3,9,3,10],[3,11,3,12],[3,13,3,14],[4,13,4,14],[5,1,5,2],[5,3,5,4],[5,5,5,6],[5,7,5,8],[5,9,5,10],[5,11,5,12],[5,13,5,14],[4,1,4,2],[4,3,4,4],[4,5,4,6],[4,7,4,8],[4,9,4,10],[4,11,4,12],[6,9,6,10],[9,1,9,2],[9,3,9,4],[9,5,9,6],[9,7,9,8],[9,9,9,10],[9,11,9,12],[9,13,9,14],[10,1,10,2],[10,3,10,4],[10,5,10,6],[10,7,10,8],[10,9,10,10],[10,11,10,12],[10,13,10,14],[11,13,11,14],[29,1,30,9],[11,1,11,2],[11,3,11,4],[11,5,11,6],[11,7,11,8],[11,9,11,10],[11,11,11,12],[18,2,20,12]]}
["Alternative GPL Calculator - Metals"]
[null,"Antimony (mg/Kg)","SPLP or TCLP (mg/L)","Arsenic (mg/Kg)","SPLP or TCLP (mg/L)","Barium (mg/Kg)","SPLP or TCLP (mg/L)","Beryllium (mg/Kg)","SPLP or TCLP (mg/L)","Cadmium (mg/Kg)","SPLP or TCLP (mg/L)","Chromium (mg/Kg)","SPLP or TCLP (mg/L)","Copper (mg/Kg)","SPLP or TCLP (mg/L)"]
[]
["R = Csoil / Cleachate",{"$f":"B3/C3","v":{"$error":"#DIV/0!"}},null,{"$f":"D3/E3","v":{"$error":"#DIV/0!"}},null,{"$f":"F3/G3","v":{"$error":"#DIV/0!"}},null,{"$f":"H3/I3","v":{"$error":"#DIV/0!"}},null,{"$f":"J3/K3","v":{"$error":"#DIV/0!"}},null,{"$f":"L3/M3","v":{"$error":"#DIV/0!"}},null,{"$f":"N3/O3","v":{"$error":"#DIV/0!"}}]
["CW",6.0000000000000001E-3,null,0.05,null,2,null,4.0000000000000001E-3,null,5.0000000000000001E-3,null,0.1,null,1.3]
["Alternative GPL = (292.9)*R*Cw",{"$f":"292.9*B4*B5","v":{"$error":"#DIV/0!"}},null,{"$f":"292.9*D4*D5","v":{"$error":"#DIV/0!"}},null,{"$f":"292.9*F4*F5","v":{"$error":"#DIV/0!"}},null,{"$f":"292.9*H4*H5","v":{"$error":"#DIV/0!"}},null,{"$f":"292.9*J4*J5","v":{"$error":"#DIV/0!"}},null,{"$f":"292.9*L4*L5","v":{"$error":"#DIV/0!"}},null,{"$f":"292.9*N4*N5","v":{"$error":"#DIV/0!"}}]
[]
[null,"Lead (mg/Kg)","SPLP or TCLP (mg/L)","Mercury (mg/Kg)","SPLP or TCLP (mg/L)","Nickel (mg/Kg)","SPLP or TCLP (mg/L)","Selenium (mg/Kg)","SPLP or TCLP (mg/L)","Thallium (mg/Kg)","SPLP or TCLP (mg/L)","Enter Chem (mg/Kg)","SPLP or TCLP (mg/L)","Enter Chem (mg/Kg)","SPLP or TCLP (mg/L)"]
[]
["R = Csoil / Cleachate",{"$f":"B9/C9","v":{"$error":"#DIV/0!"}},null,{"$f":"D9/E9","v":{"$error":"#DIV/0!"}},null,{"$f":"F9/G9","v":{"$error":"#DIV/0!"}},null,{"$f":"H9/I9","v":{"$error":"#DIV/0!"}},null,{"$f":"J9/K9","v":{"$error":"#DIV/0!"}},null,{"$f":"L9/M9","v":{"$error":"#DIV/0!"}},null,{"$f":"N9/O9","v":{"$error":"#DIV/0!"}}]
["CW",0.05,null,2E-3,null,0.1,null,0.05,null,2E-3,null," "]
["Alternative GPL = (292.9)*R*Cw",{"$f":"292.9*B10*B11","v":{"$error":"#DIV/0!"}},null,{"$f":"292.9*D10*D11","v":{"$error":"#DIV/0!"}},null,{"$f":"292.9*F10*F11","v":{"$error":"#DIV/0!"}},null,{"$f":"292.9*H10*H11","v":{"$error":"#DIV/0!"}},null,{"$f":"292.9*J10*J11","v":{"$error":"#DIV/0!"}},null,{"$f":"292.9*L10*L11","v":{"$error":"#DIV/0!"}},null,{"$f":"292.9*N10*N11","v":{"$error":"#DIV/0!"}}]
[]
["Formula:","Xs = (292.9)*(Csoil / Cleachate)*Cw"]
[null,"Xs","= The Alternative GPL; The maximum allowable total metals concentration in soil which achieves protection of groundwater quality."]
[null,292.89999999999998,"= This constant results from calculations involving the mixing cell dimensions, groundwater flow rate, and infiltration rate for the base case conditions."]
[null,"Csoil","= Total metals concentration in a soil (mg/Kg)."]
[null,"Cleachate","= The TCLP or SPLP metal concentration (mg/L)."]
[null,"R","= The ratio between the total metals content in a soil (Csoil) and the TCLP or SPLP leachate result (Cleachate). Default  GPLs for metals assumes the worst-case leachable fraction from a TCLP or SPLP of 20:1. The ratio may be greater and calculating a site specific \"R\" value based on the ratio between the total metals content in  soil and the TCLP or SPLP leachate result allows for the calculation of an alternative GPL for metals."]
[]
{"$rows_left_out":11}
{"sheet":"Soil Phase Partitioning Calc","index":5,"n_rows":49,"n_cols":8,"rows_kept":49,"cut":false,"hidden":false,"merged":[[37,0,37,7]]}
["2008-06-03"]
[]
["Calculate equilibrium soil phase concentrations "]
[]
["Cg (ug/l) =Ct(( Hd*Pb/((foc)(Koc)(Pb)+Ow +Hd (Ot-Ow)))"]
[]
["R (unitless) =  Hd*Pb/((foc)(Koc)(Pb)+Ow +Hd (Ot-Ow))"]
[]
["Ct ( ug/kg)= Cg/ R"]
[]
["Cl (ug/l) =  Cg/H"]
[]
[]
["Select chemical from drop down list, G14",null,null,null,null,null,"Toluene"]
[null,null,null,null,null,"Calculation ",null,"Data Enter"]
["foc = fraction of organic carbon =",null,null,null,null,{"$f":"$H16","v":1E-3},null,1E-3]
["Koc = soil distribution coefficient (ml/g) = ",null,null,null,null,{"$f":"IF($G$14=\"Enter chemical properties\",$H17,VLOOKUP($G$14,'Lookup Table'!A8:J79,2))","v":182},null,1]
["Kh = Henry's Constant  =",null,null,null,null,{"$f":"IF($G$14=\"Enter chemical properties\",$H18,VLOOKUP($G$14,'Lookup Table'!A8:J79,3))","v":0.27200000000000002},null,1]
["S = solubility in water (mg/l) =",null,null,null,null,{"$f":"IF($G$14=\"Enter chemical properties\",$H19,VLOOKUP($G$14,'Lookup Table'!A8:J79,4))","v":530},null,1]
[]
{"$rows_left_out":30}
{"sheet":"Lookup Table","index":6,"n_rows":109,"n_cols":10,"rows_kept":109,"cut":false,"hidden":false,"merged":[[86,0,87,9],[6,6,6,8],[80,0,81,9]]}
[]
[]
[]
[null,null,null,"Chemical Properties"]
[]
[]
["CONTAMINANT","Koc","Kh","S","Water Quality ","Risk-based","Residential SRL (mg/kg)",null,null,"Non-Residential"]
[null,"(L/Kg)","(dimensionless)","(mg/L)","Standard (ug/L)","Standard (ug/l)","10-6 ELCR","10-5 ELCR","Non-carc"," SRL (mg/kg)"]
["1,1,1-Trichloroethane*",110,0.70499999999999996,1300,7,null,null,null,1200,1200]
["1,1,2,2-Tetrachloroethane",93.3,1.41E-2,3000,null,0.2,0.42,4.2,null,9.3000000000000007]
["1,1,2-Trichlorethane",50.1,3.7400000000000003E-2,4400,5,null,0.74,7.4,null,16]
["1,1-Dichloroethane",31.6,0.23,5100,null,700,null,null,510,1700]
["1,1-Dichloroethylene(DCE)",58.9,1.07,2300,7,null,null,null,120,410]
["1,2,4-Trimethylbenzene",3720,0.23370000000000002,57,null,12,null,null,52,170]
["1,2-Dibromoethane ",28.1,2.9000000000000001E-2,3400,0.05,null,2.9000000000000001E-2,0.28999999999999998,null,0.63]
["1,2-Dichlorobenzene (ortho)",620,7.8200000000000006E-2,160,600,null,null,null,600,600]
["1,2-Dichloroethane (DCA)",17.399999999999999,4.0099999999999997E-2,8500,5,null,0.28000000000000003,2.8,null,6]
["1,2-Dichloropropane",43.7,0.115,2800,5,null,0.34,3.4,null,7.4]
["1,3,5-Trimethylbenzene",819,0.32,48,null,12,null,null,21,70]
["1,3-Butadiene",120,7.298,735,null,0.1,5.8000000000000003E-2,0.57999999999999996,null,1.2]
{"$rows_left_out":90}
{"sheet":"IntercalsJury1","index":7,"n_rows":317,"n_cols":40,"rows_kept":317,"cut":false,"hidden":true,"merged":[]}
["2008-05-10",null,"Solution of Jury 1 Equation"]
[]
[]
[null,"Ct = total soil contamination, ug/kg",null,null,null,null,null,null,null,null,null,null,{"$f":"'Alt-GPL Calc for VOCs'!I13","v":100}]
[null,"Co (ug/l)",null,null,null,null,null,null,null,null,null,null,{"$f":"$M$4*$M$10","v":150}]
[null,"T1/2 (d)",null,null,null,null,null,null,null,null,null,null,{"$f":"'Alt-GPL Calc for VOCs'!$I$11","v":100000}]
[null,"Kh (dimensionless)",null,null,null,null,null,null,null,null,null,null,{"$f":"'Alt-GPL Calc for VOCs'!I7","v":1}]
[null,"S (water solubility, mg/l)",null,null,null,null,null,null,null,null,null,null,{"$f":"'Alt-GPL Calc for VOCs'!I8","v":1}]
[null,"Φ(total porosity)",null,null,null,null,null,null,null,null,null,null,{"$f":"'Alt-GPL Calc for VOCs'!$I$16","v":0.5}]
[null,"Pb (g/cm3) (dry bulk density)",null,null,null,null,null,null,null,null,null,null,{"$f":"'Alt-GPL Calc for VOCs'!I17","v":1.5}]
[null,"foc",null,null,null,null,null,null,null,null,null,null,{"$f":"'Alt-GPL Calc for VOCs'!$I$19","v":1E-3}]
[null,"Dga (cm2/d)",null,null,null,null,null,null,null,null,null,null,{"$f":"'Alt-GPL Calc for VOCs'!$I$21","v":7000}]
[null,"D1w(cm2/d)",null,null,null,null,null,null,null,null,null,null,{"$f":"'Alt-GPL Calc for VOCs'!$I$22","v":0.7}]
[null,"L (cm)(depth of incorporation)",null,null,null,null,null,null,null,null,null,null,{"$f":"'Alt-GPL Calc for VOCs'!I25","v":1000}]
[null,"θ (vol/vol)= water content",null,null,null,null,null,null,null,null,null,null,{"$f":"'Alt-GPL Calc for VOCs'!I18","v":0.45}]
[null,"Jw (water flux- cm/d)",null,null,null,null,null,null,null,null,null,null,{"$f":"'Alt-GPL Calc for VOCs'!I24","v":7.0000000000000001E-3}]
[null,"Koc (cm3/g)",null,null,null,null,null,null,null,null,null,null,{"$f":"'Alt-GPL Calc for VOCs'!I9","v":1}]
[null,"z -cm(depth to water) or depth of interest",null,null,null,null,null,null,null,null,null,null,{"$f":"'Alt-GPL Calc for VOCs'!I26","v":1000}]
[null,"a(air filled porosity)",null,null,null,null,null,null,null,null,null,null,{"$f":"$M$9-$M$15","v":4.9999999999999989E-2}]
[null,"t (days) (calculation test)",null,null,null,null,null,null,null,null,null,null,{"$f":"'Alt-GPL Calc for VOCs'!I32","v":10}]
{"$rows_left_out":298}
{"sheet":"OutputJury1","index":8,"n_rows":93,"n_cols":14,"rows_kept":93,"cut":false,"hidden":true,"merged":[]}
["2008-11-01"]
[]
[null,null,null,"Outputs from Soil Contamination Versus Time, IntercalcsJury1"]
[]
[null,null,null,null,null,{"$f":"IF('Alt-GPL Calc for VOCs'!$I$13>IntercalsJury1!$M$30*1000,\"Warning: Input soil concentration exceeds maximum allowed\",\" \")","v":" "}]
[]
[]
[]
[]
[]
[]
[]
[]
[]
[]
[]
[]
[]
[]
[]
{"$rows_left_out":74}
{"sheet":"GPL","index":9,"n_rows":245,"n_cols":7,"rows_kept":245,"cut":false,"hidden":true,"merged":[]}
["2008-06-01"]
[null,null,"Saturated Zone Mixing Cell Model",null,null,null,"(calculates soil concentration  protective of groundwater quality)"]
[]
[]
[]
[]
[null,"Sc = Distance from edge of release to compliance point (m)",null,null,null,{"$f":"'Alt-GPL Calc for VOCs'!I27","v":30.5}]
[]
[null,"s = Screen interval (m)",null,null,null,{"$f":"'Alt-GPL Calc for VOCs'!I29","v":8.1999999999999993}]
[]
[null,"WQS = Water quality standard (ug/l)",null,null,null,{"$f":"'Alt-GPL Calc for VOCs'!I10","v":1}]
[]
[null,"T1/2 GW = Saturated zone 1/2 life (d)",null,null,null,{"$f":"'Alt-GPL Calc for VOCs'!I12","v":100000}]
[]
[null,"v = Groundwater velocity [v=Ki/n] (cm/d)",null,null,null,{"$f":"'Alt-GPL Calc for VOCs'!I30","v":10}]
[]
[null,"Si = Infiltration rate (cm/d)",null,null,null,{"$f":"'Alt-GPL Calc for VOCs'!I24","v":7.0000000000000001E-3}]
[null," (under source zone)"]
[]
[null,"Ai= Infiltration rate (cm/d)",null,null,null,{"$f":"'Alt-GPL Calc for VOCs'!I31","v":7.0000000000000001E-3}]
{"$rows_left_out":226}
{"sheet":"IntercalcsJury2","index":10,"n_rows":263,"n_cols":43,"rows_kept":263,"cut":false,"hidden":true,"merged":[]}
["2008-01-28",null,"Solution of Jury Equation",null,null,"This spreadsheet estimates  C/Co at depth given a specific time."]
[]
[]
[null,"Ct = total soil contamination (ug/kg)",null,null,null,null,null,null,null,null,null,null,{"$f":"'Alt-GPL Calc for VOCs'!I13","v":100}]
[null,"Co (ug/cm3) = (Ct)(Pbw)",null,null,null,null,null,null,null,null,null,null,{"$f":"$M$4*$M$9","v":150}]
[null,"T1/2 (d)",null,null,null,null,null,null,null,null,null,null,{"$f":"'Alt-GPL Calc for VOCs'!I11","v":100000}]
[null,"Kh (dimensionless)",null,null,null,null,null,null,null,null,null,null,{"$f":"'Alt-GPL Calc for VOCs'!$I$7","v":1}]
[null,"Φ(total porosity)",null,null,null,null,null,null,null,null,null,null,{"$f":"'Alt-GPL Calc for VOCs'!I16","v":0.5}]
[null,"Pb dry g/cm3 ",null,null,null,null,null,null,null,null,null,null,{"$f":"'Alt-GPL Calc for VOCs'!I17","v":1.5}]
[null,"foc",null,null,null,null,null,null,null,null,null,null,{"$f":"'Alt-GPL Calc for VOCs'!I19","v":1E-3}]
[null,"Dga (cm2/d)",null,null,null,null,null,null,null,null,null,null,{"$f":"'Alt-GPL Calc for VOCs'!I21","v":7000},"(default)"]
[null,"D1w(cm2/d)",null,null,null,null,null,null,null,null,null,null,{"$f":"'Alt-GPL Calc for VOCs'!I22","v":0.7},"(default)","         "]
[null,"L (cm)(depth of incorporation)",null,null,null,null,null,null,null,null,null,null,{"$f":"'Alt-GPL Calc for VOCs'!I25","v":1000}," "]
[null,"θ (vol/vol)= water content",null,null,null,null,null,null,null,null,null,null,{"$f":"'Alt-GPL Calc for VOCs'!I18","v":0.45}]
[null,"Jw (water flux- cm/d)",null,null,null,null,null,null,null,null,null,null,{"$f":"'Alt-GPL Calc for VOCs'!I24","v":7.0000000000000001E-3}]
[null,"Koc (cm3/g)",null,null,null,null,null,null,null,null,null,null,{"$f":"'Alt-GPL Calc for VOCs'!$I$9","v":1}]
[null,"z (total vadose zone depth, cm)",null,null,null,null,null,null,null,null,null,null,{"$f":"'Alt-GPL Calc for VOCs'!I34","v":3000}]
[null,"a(air filled porosity)",null,null,null,null,null,null,null,null,null,null,{"$f":"$M$8-$M$14","v":4.9999999999999989E-2}]
[null,"t (days) (calculation test)",null,null,null,null,null,null,null,null,null,null,{"$f":"'Alt-GPL Calc for VOCs'!I33","v":365}]
[null,"d(diffusion layer thickness,cm)",null,null,null,null,null,null,null,null,null,null,0.5,"(default)"]
{"$rows_left_out":244}
{"sheet":"OutputJury 2","index":11,"n_rows":90,"n_cols":6,"rows_kept":90,"cut":false,"hidden":true,"merged":[]}
["2008-02-27"]
[]
[null,null,null,null,"Solution of Jury 2 equation with time fixed and depth varies"]
[]
[]
[null,null,null,null,null,{"$f":"IF('Alt-GPL Calc for VOCs'!$I$13>IntercalsJury1!$M$30*1000,\"Warning: Input soil concentration exceeds maximum allowed\",\" \")","v":" "}]
[]
[]
[]
[]
[]
[]
[]
[]
[]
[]
[]
[]
[]
[]
{"$rows_left_out":70}