{"text_format":"1","workbook":"xlsx","n_sheets":25,"sheets":["Change log","Instructions","Glossary","Revision Summary","Soil VOC Table","Soil PAH Metals Table","Soil Vapor Survey Table","GW Elevations & Gradient","GW VOCs Table","GW PAHs & Metals","Site Well,Boring Construction","GW Parameter Table","Prototype Tab","Free Product Recovery Table","Excavation Detail Table","Air Sparge Soil Vapor Extractio","SVE Table","Detail SVE Table","AS Table","Detail AS Table","DPE-P&T Table","ISCO, AC, & Bio Injection","CSM","Well Summary Table","Dropdown Options"],"not_rendered":{"charts":0,"images":1,"macros":1,"external_links":3,"defined_names":91,"comments":11,"pivot_tables":0},"unopened":[],"bounds":{"document_bytes":16777216,"sheet_cells":100000,"rows_first":2000,"rows_last":500,"rows_between":2000,"halvings":0,"cell_chars":16384,"cell_head_chars":4096},"cells_cut":0,"cells_raw":0,"read":"whole","date_system":"1900"}

{"sheet":"Change log","index":0,"n_rows":11,"n_cols":2,"rows_kept":11,"cut":false,"hidden":true,"merged":[]}
["Note: This may not reflect all changes that have occurred since the creation of the eCSM."]
["Date","Changes made to cost sheet"]
["2017-08-25","Fixed instruction wording on \"Soil VOC Table\", \"Soil Vapor Survey Table\", and \"GW Elev and VOC Table\" tabs."]
["2017-08-29","Added additional instruction language to all remediation related tabs."]
["2017-11-14","Changed \"Acenaphthylene/Acenaphthalene\" on the \"Soil PAH Metals Table\" and \"GW Elev and PAH Metals Table\" tabs to \"Acenaphthene\"."]
["2017-11-14","Added \"Revision Summary\" tab."]
["2017-11-14","Added a “Uses of groundwater” field in the Site Specific Information tab under the section Groundwater Information."]
["2017-11-14","Added \"Additional Info\" tab."]
["2018-01-19","Fixed the Corrective Action Summary table on the \"GW Trends Table\" tab."]
["2018-08-06","Added \"Change log\" tab."]
["2018-08-07","- Removed \"mg/m3\" from Ethanol cell in Soil Vapor Survey tab.\n- Modified wording in Notes cell in green tabs."]

{"sheet":"Instructions","index":1,"n_rows":43,"n_cols":11,"rows_kept":43,"cut":false,"hidden":false,"merged":[[10,8,12,17],[19,10,25,17],[27,10,29,17],[2,0,2,17],[3,0,3,17],[4,0,4,17],[5,0,8,17],[11,0,11,6],[10,0,10,6],[33,10,36,17],[42,10,43,17],[16,0,16,6],[29,0,29,6],[22,0,22,6],[14,8,16,17]]}
["The below information is to assist the user in the means and methods to populating this spreadsheet. Please read through the information carefully."]
[]
["ADEQ strongly recommends incorporating the Triad Approach when developing investigation and actions plans for environmental sites."]
["For more information, refer to Section 5.0 of the Site Investigation Guidance Manual (https://www.azdeq.gov/environ/waste/download/SI_Guidance_Manual_Final.pdf)"]
["This approach identifies systematic project planning, real-time measurement technologies, and dynamic work strategies as pillars that lead to reducing project uncertainty."]
["Release confirmation and site characterization are Site data obtained early in the life of the Site. Site data is continuously refined as corrective action efforts are implemented and new project data is gathered. It is important to know where your project is with respect to cleanup and to understand that data collection is a dynamic process and new information may lead to reassessing work that has already been completed. Developing, refining, and understanding your Site Data will lead to targeted risk reduction and reduced project time and costs."]
[]
[]
[]
[]
["Components of Site Data Evaluation and Collection",null,null,null,null,null,null,null,"All collected environmental and remediation data must be included in this report in the appropriate tabs. It is important that the existing format included in the cells are not altered. Tabs without data must not be deleted from the workbook. Do not rename, add, or move tabs. "]
["Data Gathering"]
["-Release Discovery",null,null,"-Plume Delineation"]
["-Triad Approach",null,null,"-Hydrogeological Testing"]
["-Source Definition",null,null,"-Point of Exposure Identification",null,null,null,null,"Additional information not explicitly requested in the eTables may be added at the user's discretion. Insertion of columns and data is acceptable; however, the omission and/or removal of data requested is unacceptable."]
["-Site/Release Understanding"]
["Data Evaluation"]
["-Point of Exposure Pathway Evaluation"]
["-Site-Specific Target Level Calculations",null,null,null,null,null,null,null,"Additional instructions pertaining to each tab is given below:"]
["-Mass Estimation Calculations",null,null,null,null,null,null,null,"Soil VOC Table:",null,"-Two buttons are present at the top. One expands the analyte list to show all analytes. The second button reduces the visible list to only show detections (values without \"<\"). When inputting qualifiers, make sure to include a space between the result and the qualifier.\n-Insert rows between the last line of data and the last line of the table. Highlight the number of rows needed, right-click, go to insert.\n-DO NOT ctrl-V when pasting data into the table, right-click and PASTE VALUES."]
["-Identify and Fill Data Gaps",null,null,null,null,null,null,null,"Soil Vapor Survey:"]
["-Determine if Active Remediation is Necessary",null,null,null,null,null,null,null,"GW VOCs Table:"]
["Remedial Method Implementation"]
["-Clearly Define Remedial Objectives"]
["-Determine Treatment Area"]
["-Identify Critical Data Needs for the Selected Remedy"]
["-Identify Performance Metrics"]
["-Establish Performance Milestones",null,null,null,null,null,null,null,"Soil PAH Table:",null,"-Insert rows between the last line of data and the last line of the table. Highlight the number of rows needed, right-click, go to insert.\n-DO NOT ctrl-V when pasting data into the table, right-click and PASTE VALUES."]
["-Identify Environmental Data Needs",null,null,null,null,null,null,null,"GW PAH Table:"]
["Remedial Method Evaluation"]
["-Incorporate New Data"]
["-Determine Whether Performance Metrics were Met",null,null,null,null,null,null,null,"All Analytical Tables:",null,"Have a row containing chemical CAS Numbers for easy importing"]
["-Determine Whether Release Objectives were Met"]
["-Identify additional data gaps",null,null,null,null,null,null,null,"GW Elevations Table:",null,"-A reference table for well elevations is provided at the top to the right of the data table. \n-A reference table for groundwater gradient and flow direction is provided at the top to the right of the data table."]
[]
[]
[]
[]
[null,null,null,null,null,null,null,null,"Site Well/Boring Table:",null,"Add survey information in section located to the right side of the table."]
[]
[null,null,null,null,null,null,null,null,"Well Summary Table:",null,"Users can directly copy and paste results from the ADWR well search page."]
[]
[null,null,null,null,null,null,null,null,"CSM Tab:",null,"This tab provides an example of information that should be provided in the submittal, please modify information relevant to your specific site."]

{"sheet":"Glossary","index":2,"n_rows":44,"n_cols":2,"rows_kept":44,"cut":false,"hidden":false,"merged":[[0,0,0,1]]}
["Glossary"]
["µg/L","Micrograms per liter"]
["µS/cm","MicroSiemens per centimeter"]
["ADEQ","Arizona Department of Environmental Quality"]
["AWQS","Aquifer Water Quality Standard"]
["bgs","Below ground surface"]
["cfm","Cubic feet per minute"]
["cm/sec","Centimeter per second"]
["COC","Chemical of concern"]
["cu.ft.","Cubic feet"]
["DEUR","Declaration of Environmental Use Restriction"]
["DO","Dissolved oxygen"]
["DPE","Dual phase extraction"]
["fpm","Feet per minute"]
["ft","Feet"]
["gals","Gallons"]
["GPLs","Groundwater Protection Levels"]
["H2O\"","Inches of water"]
["Hg","Mercury"]
["HGBLs","Health Based Guidance Levels"]
["ID","Identification Number"]
["lbs","Pounds"]
["LUST","Leaking Underground Storage Tank"]
["mg/L","Milligrams per liter"]
["mV","Millivolt"]
["N/A","Not applicable"]
["NE","Not Established"]
["NC","Not Calculated"]
["nrSRLs","Non-residential Soil Remediation Levels"]
["ORP","Oxidation reduction potential"]
["P&T","Pump and treat"]
["PID","Photoionization detector"]
["ppm","Parts per million"]
["ppmv","Parts per million by volume"]
["psi","Pounds per square inch"]
["rSRLs","Residential Soil Remediation Levels"]
["scfm","Standard cubic feet per minute"]
["sq.ft.","square feet"]
["TPH","Total petroleum hydrocarbon"]
["TVPH","Total volatile petroleum hydrocarbon"]
["UST","Underground Storage Tank"]
["VFH","Volatile fuel hydrocarbon"]
["VOC","volatile organic compound"]
["WQARF","Water Quality Assurance Revolving Fund"]

{"sheet":"Revision Summary","index":3,"n_rows":3,"n_cols":20,"rows_kept":3,"cut":false,"hidden":false,"merged":[[0,0,0,19],[1,0,1,19]]}
["Revision Summary"]
["Put an \"X\" below the name of the tab that has been updated"]
["Date of revision (must match pertinent PDF report)","Name of Matching Report","Soil VOC","Soil PAH Metals","Soil Vapor Survey","GW Elev and Gradient","GW VOCs Table","GW PAHs & Metals","Site Well, Boring Construction","GW Parameter Table","Free Product Recovery","Excavation\nDetail","SVE Table","Detail SVE","AS Table","Detail AS","DPE-P&T Table","ISCO, AC, Bio Injection","CSM","Well Summary Table"]

{"sheet":"Soil VOC Table","index":4,"n_rows":55,"n_cols":82,"rows_kept":55,"cut":false,"hidden":false,"merged":[[2,1,3,1],[2,0,3,0],[2,5,3,5],[2,6,3,6],[2,2,3,2],[2,3,3,3],[2,4,3,4]]}
["Soil VOC Results Table",null,null,null,null,null,null,null,null,null,null,null,null,null,null,null,null,null,null,null,null,null,null,null,null,null,null,null,null,null,null,null,null,null,null,null,null,null,null,null,null,null,null,null,null,null,null,null,null,null,null,null,null,null,null,null,null,null,null,null,null,null,null,null,null,null,null,null,null,null,null,null,null,null,null,null,null,null,null,null,null,"Insert rows between the last line of data and the last line of the table. Highlight the number of rows needed, right-click, go to insert."]
["Notes: ","If a result is less than the detection limit, input \"<\" followed by the detection limit. If the compound does not have a laboratory detection or laboratory limit (example: some labs may not have a detection/reporting limit for certain TICs), then input “ND”. If a compound is not analyzed, input \"NA\".",null,null,null,null,null,null,null,null,null,null,null,null,null,null,null,null,null,null,null,null,null,null,null,null,null,null,null,null,null,null,null,null,null,null,null,null,null,null,null,null,null,null,null,null,null,null,null,null,null,null,null,null,null,null,null,null,null,null,null,null,null,null,null,null,null,null,null,null,null,null,null,null,null,null,null,null,null,null,null,"DO NOT ctrl-V when pasting data into the table, right-click and PASTE VALUES"]
["If a confirmation sample, what was the original soil sample ID for comparison?","Confirmation sample? ","Sample ID","Sample Date","Sample Depth (ft bgs)","USCS Classification","PID Reading (ppm)",null,null,null,"ANALYTICAL METHOD (UNITS)"]
[null,null,null,null,null,null,null,"Acetone","Acrolein","Acrylonitrile","Benzene","Bromobenzene","Bromodichloromethane","Bromoform","Bromomethane","1,3-Butadiene","n-Butylbenzene","sec-Butylbenzene","tert-Butylbenzene","Carbon Tetrachloride","Carbon disulfide","Chlorobenzene","Chlorodibromomethane","Chloroethane","Chloroform","Chloromethane","Cyclohexane","2-Chlorotoluene","4-Chlorotoluene","1,2-Dibromo-3-Chloropropane","1,2-Dibromoethane (EDB)","Dibromomethane","1,2-Dichlorobenzene","1,3-Dichlorobenzene","1,4-Dichlorobenzene","Dichlorodifluoromethane","1,1-Dichloroethane","1,2-Dichloroethane (1,2-DCA)","1,1-Dichloroethene","cis-1,2-Dichloroethene","trans-1,2-Dichloroethene","1,2-Dichloropropane","1,1-Dichloropropene","1,3-Dichloropropane","cis-1,3-Dichloropropene","trans-1,3-Dichloropropene","2,2-Dichloropropane","Dicyclopentadiene","Di-isopropyl ether","Ethylbenzene","4-Ethyltoluene","Hexachloro-1,3-butadiene","n-Hexane","Isopropylbenzene (cumene)","p-Isopropyltoluene (cymene)","2-Butanone (MEK)","Methyl Cyclohexane","Methylene Chloride","4-Methyl-2-pentanone (MIBK)","Methyl tert-butyl ether (MTBE)","Naphthalene","Propene","n-Propylbenzene","Styrene","1,1,1,2-Tetrachloroethane","1,1,2,2-Tetrachloroethane","1,1,2-Trichlorotrifluoroethane","Tetrachloroethene","Toluene","1,2,3-Trichlorobenzene","1,2,4-Trichlorobenzene","1,1,1-Trichloroethane","1,1,2-Trichloroethane","Trichloroethene","Trichlorofluoromethane","1,2,3-Trichloropropane","1,2,4-Trimethylbenzene","1,2,3-Trimethylbenzene","1,3,5-Trimethylbenzene","Vinyl chloride","Xylenes, total"]
["CAS Numbers",null,null,null,null,null,null,"67-64-1 ","107-02-8 ","107-13-1 ","71-43-2 ","108-86-1 ","75-27-4 ","75-25-2 ","74-83-9 ","106-99-0 ","104-51-8 ","135-98-8 ","98-06-6 ","56-23-5 ","75-15-0 ","108-90-7 ","124-48-1 ","75-00-3 ","67-66-3 ","74-87-3 ","110-82-7 ","95-49-8 ","106-43-4","96-12-8 ","106-93-4 ","74-95-3 ","95-50-1 ","541-73-1 ","106-46-7 ","75-71-8 ","75-34-3 ","107-06-2 ","75-35-4 ","156-59-2 ","156-60-5 ","78-87-5 ","563-58-6","142-28-9 ","10061-01-5","10061-02-6","594-20-7","77-73-6 ","108-20-3","100-41-4 ","622-96-8","87-68-3 ","110-54-3 ","98-82-8 ","99-87-6","78-93-3 ","108-87-2 ","75-09-2 ","108-10-1","1634-04-4 ","91-20-3 ","115-07-1","103-65-1 ","100-42-5 ","630-20-6 ","79-34-5 ","76-13-1 ","127-18-4 ","108-88-3 ","87-61-6","120-82-1 ","71-55-6 ","79-00-5 ","79-01-6 ","75-69-4 ","96-18-4 ","95-63-6 ","526-73-8","108-67-8 ","75-01-4 ","1330-20-7 "]
["ADEQ Release Confirmation Levels (RCLs) (mg/kg)",null,null,null,null,null,null,"NE","NE","NE",0.25,"NE","NE","NE","NE",0.5,0.25,0.25,0.25,"NE",0.44,"NE","NE","NE","NE","NE",0.5,"NE","NE","NE",0.25,"NE","NE","NE","NE","NE","NE",0.25,"NE","NE","NE","NE","NE","NE","NE","NE","NE",0.5,"NE",0.5,0.5,"NE",0.5,0.25,0.25,"NE",0.5,"NE","NE",0.25,0.25,0.5,0.25,"NE","NE","NE","NE","NE",0.25,"NE","NE","NE","NE","NE","NE","NE",0.25,"NE",0.25,"NE",0.5]
["Tier 1 Residential Standard (mg/kg)",null,null,null,null,null,null,14000,0.1,2.1,0.65,28,8.3000000000000007,690,3.9,0.57999999999999996,240,220,390,2.5,360,150,11,30,9.4,48,140,160,"NE",5.3,0.28999999999999998,67,600,530,35,94,510,2.8,120,43,69,3.4,"NE",100,"NE","NE","NE",0.54,"NE",400,"NE",70,110,92,"NE",23000,230,93,"NE",320,56,"NE",240,1500,32,4.2,5600,5.0999999999999996,650,"NE",62,1200,7.4,30,390,0.05,52,"NE",21,8.5000000000000006E-2,270]
["Minimum GPL (mg/kg)",null,null,null,null,null,null,"NE","NE","NE",0.71,"NE","NE","NE","NE","NE","NE","NE","NE",1.6,"NE",22,"NE","NE","NE","NE","NE","NE","NE",1.4999999999999999E-2,3.3E-3,"NE",72,"NE",9.3000000000000007,"NE","NE",0.21,0.81,4.9000000000000004,8.4,0.28000000000000003,"NE","NE","NE","NE","NE","NE","NE",120,"NE","NE","NE","NE","NE","NE","NE","NE","NE","NE","NE","NE","NE",36,"NE","NE","NE",1.3,400,"NE","NE",1,"NE",0.61,"NE","NE","NE","NE","NE","NE",2200]
[null,null,null,null,null,null,null,{"$f":"IFERROR(_xlfn.IFS(SUM(H10:H5002)>0,\"\",COUNTIF(H10:H5002,\"*\"&\" \"&\"*\"),\"\"),\"X\")","v":"X"},{"$f":"IFERROR(_xlfn.IFS(SUM(I10:I5002)>0,\"\",COUNTIF(I10:I5002,\"*\"&\" \"&\"*\"),\"\"),\"X\")","v":"X"},"X","X",{"$f":"IFERROR(_xlfn.IFS(SUM(L10:L5002)>0,\"\",COUNTIF(L10:L5002,\"*\"&\" \"&\"*\"),\"\"),\"X\")","v":"X"},{"$f":"IFERROR(_xlfn.IFS(SUM(M10:M5002)>0,\"\",COUNTIF(M10:M5002,\"*\"&\" \"&\"*\"),\"\"),\"X\")","v":"X"},{"$f":"IFERROR(_xlfn.IFS(SUM(N10:N5002)>0,\"\",COUNTIF(N10:N5002,\"*\"&\" \"&\"*\"),\"\"),\"X\")","v":"X"},{"$f":"IFERROR(_xlfn.IFS(SUM(O10:O5002)>0,\"\",COUNTIF(O10:O5002,\"*\"&\" \"&\"*\"),\"\"),\"X\")","v":"X"},{"$f":"IFERROR(_xlfn.IFS(SUM(P10:P5002)>0,\"\",COUNTIF(P10:P5002,\"*\"&\" \"&\"*\"),\"\"),\"X\")","v":"X"},{"$f":"IFERROR(_xlfn.IFS(SUM(Q10:Q5002)>0,\"\",COUNTIF(Q10:Q5002,\"*\"&\" \"&\"*\"),\"\"),\"X\")","v":"X"},{"$f":"IFERROR(_xlfn.IFS(SUM(R10:R5002)>0,\"\",COUNTIF(R10:R5002,\"*\"&\" \"&\"*\"),\"\"),\"X\")","v":"X"},{"$f":"IFERROR(_xlfn.IFS(SUM(S10:S5002)>0,\"\",COUNTIF(S10:S5002,\"*\"&\" \"&\"*\"),\"\"),\"X\")","v":"X"},{"$f":"IFERROR(_xlfn.IFS(SUM(T10:T5002)>0,\"\",COUNTIF(T10:T5002,\"*\"&\" \"&\"*\"),\"\"),\"X\")","v":"X"},{"$f":"IFERROR(_xlfn.IFS(SUM(U10:U5002)>0,\"\",COUNTIF(U10:U5002,\"*\"&\" \"&\"*\"),\"\"),\"X\")","v":"X"},{"$f":"IFERROR(_xlfn.IFS(SUM(V10:V5002)>0,\"\",COUNTIF(V10:V5002,\"*\"&\" \"&\"*\"),\"\"),\"X\")","v":"X"},{"$f":"IFERROR(_xlfn.IFS(SUM(W10:W5002)>0,\"\",COUNTIF(W10:W5002,\"*\"&\" \"&\"*\"),\"\"),\"X\")","v":"X"},{"$f":"IFERROR(_xlfn.IFS(SUM(X10:X5002)>0,\"\",COUNTIF(X10:X5002,\"*\"&\" \"&\"*\"),\"\"),\"X\")","v":"X"},{"$f":"IFERROR(_xlfn.IFS(SUM(Y10:Y5002)>0,\"\",COUNTIF(Y10:Y5002,\"*\"&\" \"&\"*\"),\"\"),\"X\")","v":"X"},{"$f":"IFERROR(_xlfn.IFS(SUM(Z10:Z5002)>0,\"\",COUNTIF(Z10:Z5002,\"*\"&\" \"&\"*\"),\"\"),\"X\")","v":"X"},{"$f":"IFERROR(_xlfn.IFS(SUM(AA10:AA5002)>0,\"\",COUNTIF(AA10:AA5002,\"*\"&\" \"&\"*\"),\"\"),\"X\")","v":"X"},{"$f":"IFERROR(_xlfn.IFS(SUM(AB10:AB5002)>0,\"\",COUNTIF(AB10:AB5002,\"*\"&\" \"&\"*\"),\"\"),\"X\")","v":"X"},{"$f":"IFERROR(_xlfn.IFS(SUM(AC10:AC5002)>0,\"\",COUNTIF(AC10:AC5002,\"*\"&\" \"&\"*\"),\"\"),\"X\")","v":"X"},{"$f":"IFERROR(_xlfn.IFS(SUM(AD10:AD5002)>0,\"\",COUNTIF(AD10:AD5002,\"*\"&\" \"&\"*\"),\"\"),\"X\")","v":"X"},{"$f":"IFERROR(_xlfn.IFS(SUM(AE10:AE5002)>0,\"\",COUNTIF(AE10:AE5002,\"*\"&\" \"&\"*\"),\"\"),\"X\")","v":"X"},{"$f":"IFERROR(_xlfn.IFS(SUM(AF10:AF5002)>0,\"\",COUNTIF(AF10:AF5002,\"*\"&\" \"&\"*\"),\"\"),\"X\")","v":"X"},{"$f":"IFERROR(_xlfn.IFS(SUM(AG10:AG5002)>0,\"\",COUNTIF(AG10:AG5002,\"*\"&\" \"&\"*\"),\"\"),\"X\")","v":"X"},{"$f":"IFERROR(_xlfn.IFS(SUM(AH10:AH5002)>0,\"\",COUNTIF(AH10:AH5002,\"*\"&\" \"&\"*\"),\"\"),\"X\")","v":"X"},{"$f":"IFERROR(_xlfn.IFS(SUM(AI10:AI5002)>0,\"\",COUNTIF(AI10:AI5002,\"*\"&\" \"&\"*\"),\"\"),\"X\")","v":"X"},{"$f":"IFERROR(_xlfn.IFS(SUM(AJ10:AJ5002)>0,\"\",COUNTIF(AJ10:AJ5002,\"*\"&\" \"&\"*\"),\"\"),\"X\")","v":"X"},{"$f":"IFERROR(_xlfn.IFS(SUM(AK10:AK5002)>0,\"\",COUNTIF(AK10:AK5002,\"*\"&\" \"&\"*\"),\"\"),\"X\")","v":"X"},{"$f":"IFERROR(_xlfn.IFS(SUM(AL10:AL5002)>0,\"\",COUNTIF(AL10:AL5002,\"*\"&\" \"&\"*\"),\"\"),\"X\")","v":"X"},{"$f":"IFERROR(_xlfn.IFS(SUM(AM10:AM5002)>0,\"\",COUNTIF(AM10:AM5002,\"*\"&\" \"&\"*\"),\"\"),\"X\")","v":"X"},{"$f":"IFERROR(_xlfn.IFS(SUM(AN10:AN5002)>0,\"\",COUNTIF(AN10:AN5002,\"*\"&\" \"&\"*\"),\"\"),\"X\")","v":"X"},{"$f":"IFERROR(_xlfn.IFS(SUM(AO10:AO5002)>0,\"\",COUNTIF(AO10:AO5002,\"*\"&\" \"&\"*\"),\"\"),\"X\")","v":"X"},{"$f":"IFERROR(_xlfn.IFS(SUM(AP10:AP5002)>0,\"\",COUNTIF(AP10:AP5002,\"*\"&\" \"&\"*\"),\"\"),\"X\")","v":"X"},{"$f":"IFERROR(_xlfn.IFS(SUM(AQ10:AQ5002)>0,\"\",COUNTIF(AQ10:AQ5002,\"*\"&\" \"&\"*\"),\"\"),\"X\")","v":"X"},{"$f":"IFERROR(_xlfn.IFS(SUM(AR10:AR5002)>0,\"\",COUNTIF(AR10:AR5002,\"*\"&\" \"&\"*\"),\"\"),\"X\")","v":"X"},{"$f":"IFERROR(_xlfn.IFS(SUM(AS10:AS5002)>0,\"\",COUNTIF(AS10:AS5002,\"*\"&\" \"&\"*\"),\"\"),\"X\")","v":"X"},{"$f":"IFERROR(_xlfn.IFS(SUM(AT10:AT5002)>0,\"\",COUNTIF(AT10:AT5002,\"*\"&\" \"&\"*\"),\"\"),\"X\")","v":"X"},{"$f":"IFERROR(_xlfn.IFS(SUM(AU10:AU5002)>0,\"\",COUNTIF(AU10:AU5002,\"*\"&\" \"&\"*\"),\"\"),\"X\")","v":"X"},{"$f":"IFERROR(_xlfn.IFS(SUM(AV10:AV5002)>0,\"\",COUNTIF(AV10:AV5002,\"*\"&\" \"&\"*\"),\"\"),\"X\")","v":"X"},{"$f":"IFERROR(_xlfn.IFS(SUM(AW10:AW5002)>0,\"\",COUNTIF(AW10:AW5002,\"*\"&\" \"&\"*\"),\"\"),\"X\")","v":"X"},{"$f":"IFERROR(_xlfn.IFS(SUM(AX10:AX5002)>0,\"\",COUNTIF(AX10:AX5002,\"*\"&\" \"&\"*\"),\"\"),\"X\")","v":"X"},{"$f":"IFERROR(_xlfn.IFS(SUM(AY10:AY5002)>0,\"\",COUNTIF(AY10:AY5002,\"*\"&\" \"&\"*\"),\"\"),\"X\")","v":"X"},{"$f":"IFERROR(_xlfn.IFS(SUM(AZ10:AZ5002)>0,\"\",COUNTIF(AZ10:AZ5002,\"*\"&\" \"&\"*\"),\"\"),\"X\")","v":"X"},{"$f":"IFERROR(_xlfn.IFS(SUM(BA10:BA5002)>0,\"\",COUNTIF(BA10:BA5002,\"*\"&\" \"&\"*\"),\"\"),\"X\")","v":"X"},{"$f":"IFERROR(_xlfn.IFS(SUM(BB10:BB5002)>0,\"\",COUNTIF(BB10:BB5002,\"*\"&\" \"&\"*\"),\"\"),\"X\")","v":"X"},{"$f":"IFERROR(_xlfn.IFS(SUM(BC10:BC5002)>0,\"\",COUNTIF(BC10:BC5002,\"*\"&\" \"&\"*\"),\"\"),\"X\")","v":"X"},{"$f":"IFERROR(_xlfn.IFS(SUM(BD10:BD5002)>0,\"\",COUNTIF(BD10:BD5002,\"*\"&\" \"&\"*\"),\"\"),\"X\")","v":"X"},{"$f":"IFERROR(_xlfn.IFS(SUM(BE10:BE5002)>0,\"\",COUNTIF(BE10:BE5002,\"*\"&\" \"&\"*\"),\"\"),\"X\")","v":"X"},{"$f":"IFERROR(_xlfn.IFS(SUM(BF10:BF5002)>0,\"\",COUNTIF(BF10:BF5002,\"*\"&\" \"&\"*\"),\"\"),\"X\")","v":"X"},{"$f":"IFERROR(_xlfn.IFS(SUM(BG10:BG5002)>0,\"\",COUNTIF(BG10:BG5002,\"*\"&\" \"&\"*\"),\"\"),\"X\")","v":"X"},{"$f":"IFERROR(_xlfn.IFS(SUM(BH10:BH5002)>0,\"\",COUNTIF(BH10:BH5002,\"*\"&\" \"&\"*\"),\"\"),\"X\")","v":"X"},{"$f":"IFERROR(_xlfn.IFS(SUM(BI10:BI5002)>0,\"\",COUNTIF(BI10:BI5002,\"*\"&\" \"&\"*\"),\"\"),\"X\")","v":"X"},{"$f":"IFERROR(_xlfn.IFS(SUM(BJ10:BJ5002)>0,\"\",COUNTIF(BJ10:BJ5002,\"*\"&\" \"&\"*\"),\"\"),\"X\")","v":"X"},{"$f":"IFERROR(_xlfn.IFS(SUM(BK10:BK5002)>0,\"\",COUNTIF(BK10:BK5002,\"*\"&\" \"&\"*\"),\"\"),\"X\")","v":"X"},{"$f":"IFERROR(_xlfn.IFS(SUM(BL10:BL5002)>0,\"\",COUNTIF(BL10:BL5002,\"*\"&\" \"&\"*\"),\"\"),\"X\")","v":"X"},{"$f":"IFERROR(_xlfn.IFS(SUM(BM10:BM5002)>0,\"\",COUNTIF(BM10:BM5002,\"*\"&\" \"&\"*\"),\"\"),\"X\")","v":"X"},{"$f":"IFERROR(_xlfn.IFS(SUM(BN10:BN5002)>0,\"\",COUNTIF(BN10:BN5002,\"*\"&\" \"&\"*\"),\"\"),\"X\")","v":"X"},{"$f":"IFERROR(_xlfn.IFS(SUM(BO10:BO5002)>0,\"\",COUNTIF(BO10:BO5002,\"*\"&\" \"&\"*\"),\"\"),\"X\")","v":"X"},{"$f":"IFERROR(_xlfn.IFS(SUM(BP10:BP5002)>0,\"\",COUNTIF(BP10:BP5002,\"*\"&\" \"&\"*\"),\"\"),\"X\")","v":"X"},{"$f":"IFERROR(_xlfn.IFS(SUM(BQ10:BQ5002)>0,\"\",COUNTIF(BQ10:BQ5002,\"*\"&\" \"&\"*\"),\"\"),\"X\")","v":"X"},{"$f":"IFERROR(_xlfn.IFS(SUM(BR10:BR5002)>0,\"\",COUNTIF(BR10:BR5002,\"*\"&\" \"&\"*\"),\"\"),\"X\")","v":"X"},{"$f":"IFERROR(_xlfn.IFS(SUM(BS10:BS5002)>0,\"\",COUNTIF(BS10:BS5002,\"*\"&\" \"&\"*\"),\"\"),\"X\")","v":"X"},{"$f":"IFERROR(_xlfn.IFS(SUM(BT10:BT5002)>0,\"\",COUNTIF(BT10:BT5002,\"*\"&\" \"&\"*\"),\"\"),\"X\")","v":"X"},{"$f":"IFERROR(_xlfn.IFS(SUM(BU10:BU5002)>0,\"\",COUNTIF(BU10:BU5002,\"*\"&\" \"&\"*\"),\"\"),\"X\")","v":"X"},{"$f":"IFERROR(_xlfn.IFS(SUM(BV10:BV5002)>0,\"\",COUNTIF(BV10:BV5002,\"*\"&\" \"&\"*\"),\"\"),\"X\")","v":"X"},{"$f":"IFERROR(_xlfn.IFS(SUM(BW10:BW5002)>0,\"\",COUNTIF(BW10:BW5002,\"*\"&\" \"&\"*\"),\"\"),\"X\")","v":"X"},{"$f":"IFERROR(_xlfn.IFS(SUM(BX10:BX5002)>0,\"\",COUNTIF(BX10:BX5002,\"*\"&\" \"&\"*\"),\"\"),\"X\")","v":"X"},{"$f":"IFERROR(_xlfn.IFS(SUM(BY10:BY5002)>0,\"\",COUNTIF(BY10:BY5002,\"*\"&\" \"&\"*\"),\"\"),\"X\")","v":"X"},{"$f":"IFERROR(_xlfn.IFS(SUM(BZ10:BZ5002)>0,\"\",COUNTIF(BZ10:BZ5002,\"*\"&\" \"&\"*\"),\"\"),\"X\")","v":"X"},{"$f":"IFERROR(_xlfn.IFS(SUM(CA10:CA5002)>0,\"\",COUNTIF(CA10:CA5002,\"*\"&\" \"&\"*\"),\"\"),\"X\")","v":"X"},{"$f":"IFERROR(_xlfn.IFS(SUM(CB10:CB5002)>0,\"\",COUNTIF(CB10:CB5002,\"*\"&\" \"&\"*\"),\"\"),\"X\")","v":"X"},{"$f":"IFERROR(_xlfn.IFS(SUM(CC10:CC5002)>0,\"\",COUNTIF(CC10:CC5002,\"*\"&\" \"&\"*\"),\"\"),\"X\")","v":"X"}]
[]
[]
[]
[]
[]
[]
[]
[]
[]
[]
[]
[]
[]
[]
[]
[]
[]
[]
[]
[]
[]
[]
[]
[]
[]
[]
[]
[]
[]
[]
[]
[]
[]
[]
[]
[]
[]
[]
[]
[]
[]
[]
[]
[]
["Insert rows between the last line of data and the last line of the table. Highlight the number of rows needed, right-click, go to insert."]
["DO NOT ctrl-V when pasting data into the table, right-click and PASTE VALUES"]

{"sheet":"Soil PAH Metals Table","index":5,"n_rows":55,"n_cols":87,"rows_kept":55,"cut":false,"hidden":false,"merged":[[2,0,3,0],[2,6,2,19],[2,20,2,29],[2,5,3,5],[2,4,3,4],[2,3,3,3],[2,2,3,2],[2,1,3,1]]}
["Soil PAH and Metal Results Table",null,null,null,null,null,null,null,null,null,null,null,null,null,null,null,null,null,null,null,null,null,null,null,null,null,null,null,null,null,"Insert rows between the last line of data and the last line of the table. Highlight the number of rows needed, right-click, go to insert."]
["Notes: ","If a result is less than the detection limit, input \"<\" followed by the detection limit. If a compound is not analyzed, input \"NA\".",null,null,null,null,null,null,null,null,null,null,null,null,null,null,null,null,null,null,null,null,null,null,null,null,null,null,null,null,"DO NOT ctrl-V when pasting data into the table, right-click and PASTE VALUES",null,null,null,null,null,null,null,null,null,null,null,null,null,null,null,null,null,null,null,null,null,null,null,null,null,null,null,null,"Tier 1 Standard (mg/kg)",null,null,null,null,null,null,22000,3700,6.9,0.69,6.9,69,680,0.69,2300,2700,6.9,56,2300,6.1000000000000004E-3,10,15000,39,120000,23,390,390]
["If a confirmation sample, what was the original soil sample ID for comparison?","Confirmation sample? ","Sample ID","Sample Date","Sample Depth (ft bgs)","USCS Classification","ANALYTICAL METHOD (UNITS)",null,null,null,null,null,null,null,null,null,null,null,null,null,"ANALYTICAL METHOD (UNITS)"]
[null,null,null,null,null,null,"Anthracene","Acenaphthene","Benz(a)anthracene","Benzo(a)pyrene","Benzo(b)fluoranthene","Benzo(k)fluoranthene","Chrysene","Dibenz[ah]anthracene","Fluoranthene","Fluorene","Indeno [1,2,3-cd] pyrene","Napthalene","Pyrene","Tetraethyl Lead (TEL)","Arsenic","Barium","Cadmium","Chromium III","Chromium VI","Chromium (total)","Lead","Selenium","Silver","Mercury"]
["CAS Numbers",null,null,null,null,null,"120-12-7","83-32-9","56-55-3","50-32-8","205-99-2","207-08-9","218-01-9","53-70-3","206-44-0","86-73-7","193-39-5","91-20-3","129-00-0","78-00-2","7440-38-2","7440-39-3","7440-43-9","16065-83-1","18540-29-9","7440-47-3","7439-92-1","7782-49-2","7440-22-4","7487-94-7"]
["ADEQ Release Confirmation Levels (RCLs) (mg/kg)",null,null,null,null,null,0.2,0.4,0.04,0.01,0.04,0.04,0.04,0.04,0.04,0.04,0.02,0.2,0.04,"NE","NE","NE","NE","NE","NE","NE","NE","NE","NE","NE"]
["Tier 1 Residential Standard (mg/kg)",null,null,null,null,null,22000,3700,6.9,0.69,6.9,69,680,0.69,2300,2700,6.9,56,2300,6.1000000000000004E-3,10,15000,39,120000,30,"NE",400,390,390,23]
["Minimum GPL (mg/kg)",null,null,null,null,null,"NE","NE","NE","NE","NE","NE","NE","NE","NE","NE","NE","NE","NE","NE",290,12000,29,590,590,590,290,290,"NE",12]
[]
[]
[]
[]
[]
[]
[]
[]
[]
[]
[]
[]
[]
[]
[]
[]
[]
[]
[]
[]
[]
[]
[]
[]
[]
[]
[]
[]
[]
[]
[]
[]
[]
[]
[]
[]
[]
[]
[]
[]
[]
[]
[]
[]
[]
["Insert rows between the last line of data and the last line of the table. Highlight the number of rows needed, right-click, go to insert."]
["DO NOT ctrl-V when pasting data into the table, right-click and PASTE VALUES"]

{"sheet":"Soil Vapor Survey Table","index":6,"n_rows":53,"n_cols":80,"rows_kept":53,"cut":false,"hidden":false,"merged":[[2,0,3,0],[2,2,3,2],[2,1,3,1]]}
["Soil Vapor Survey Results Table",null,null,null,null,null,null,null,null,null,null,null,null,null,null,null,null,null,null,null,null,null,null,null,null,null,null,null,null,null,null,null,null,null,null,null,null,null,null,null,null,null,null,null,null,null,null,null,null,null,null,null,null,null,null,null,null,null,null,null,null,null,null,null,null,null,null,null,null,null,null,null,null,null,null,null,null,null,null,"Insert rows between the last line of data and the last line of the table. Highlight the number of rows needed, right-click, go to insert."]
["Notes: ","If a result is less than the detection limit, input \"<\" followed by the detection limit. If the compound does not have a laboratory detection or laboratory limit (example: some labs may not have a detection/reporting limit for certain TICs), then input “ND”. If a compound is not analyzed, input \"NA\".",null,null,null,null,null,null,null,null,null,null,null,null,null,null,null,null,null,null,null,null,null,null,null,null,null,null,null,null,null,null,null,null,null,null,null,null,null,null,null,null,null,null,null,null,null,null,null,null,null,null,null,null,null,null,null,null,null,null,null,null,null,null,null,null,null,null,null,null,null,null,null,null,null,null,null,null,null,"DO NOT ctrl-V when pasting data into the table, right-click and PASTE VALUES"]
["Sample ID","Sample Date","Sample Depth (ft)","TO-15 Volatile Organice Compounds (µg/m3)"]
[null,null,null,"1,1-Difluoroethane \n(1,1 DFA)","Ethanol","Acetone","Acrolein","Acrylonitrile","Benzene","Bromobenzene","Bromodichloromethane","Bromoform","Bromomethane","1,3-Butadiene","n-Butylbenzene","sec-Butylbenzene","tert-Butylbenzene","Carbon Tetrachloride","Carbon disulfide","Chlorobenzene","Chlorodibromomethane","Chloroethane","Chloroform","Chloromethane","Cyclohexane","2-Chlorotoluene","4-Chlorotoluene","1,2-Dibromo-3-Chloropropane","1,2-Dibromoethane (EDB)","Dibromomethane","1,2-Dichlorobenzene","1,3-Dichlorobenzene","1,4-Dichlorobenzene","Dichlorodifluoromethane","1,1-Dichloroethane","1,2-Dichloroethane (1,2-DCA)","1,1-Dichloroethene","cis-1,2-Dichloroethene","trans-1,2-Dichloroethene","1,2-Dichloropropane","1,1-Dichloropropene","1,3-Dichloropropane","cis-1,3-Dichloropropene","trans-1,3-Dichloropropene","2,2-Dichloropropane","Dicyclopentadiene","Di-isopropyl ether","Ethylbenzene","4-Ethyltoluene","Hexachloro-1,3-butadiene","n-Hexane","Isopropylbenzene (cumene)","p-Isopropyltoluene (cymene)","2-Butanone (MEK)","Methyl Cyclohexane","Methylene Chloride","4-Methyl-2-pentanone (MIBK)","Methyl tert-butyl ether (MTBE)","Naphthalene","Propene","n-Propylbenzene","Styrene","1,1,1,2-Tetrachloroethane","1,1,2,2-Tetrachloroethane","1,1,2-Trichlorotrifluoroethane","Tetrachloroethene","Toluene","1,2,3-Trichlorobenzene","1,2,4-Trichlorobenzene","1,1,1-Trichloroethane","1,1,2-Trichloroethane","Trichloroethene","Trichlorofluoromethane","1,2,3-Trichloropropane","1,2,4-Trimethylbenzene","1,2,3-Trimethylbenzene","1,3,5-Trimethylbenzene","Vinyl chloride","Xylenes, total"]
["CAS Numbers",null,null,"75-37-6","64-17-5","67-64-1","107-02-8","107-13-1","71-43-2","108-86-1","75-27-4","75-25-2","74-83-9","106-99-0","104-51-8","135-98-8","98-06-6","56-23-5","75-15-0","108-90-7","124-48-1","75-00-3","67-66-3","74-87-3","110-82-7","95-49-8","106-43-4","96-12-8","106-93-4","74-95-3","95-50-1","541-73-1","106-46-7","75-71-8","75-34-3","107-06-2","75-35-4","156-59-2","156-60-5","78-87-5","563-58-6","142-28-9","10061-01-5","10061-02-6","594-20-7","77-73-6","108-20-3","100-41-4","622-96-8","87-68-3","110-54-3","98-82-8","99-87-6","78-93-3","108-87-2","75-09-2","108-10-1","1634-04-4","91-20-3","115-07-1","103-65-1","100-42-5","630-20-6","79-34-5","76-13-1","127-18-4","108-88-3","87-61-6","120-82-1","71-55-6","79-00-5","79-01-6","75-69-4","96-18-4","95-63-6","526-73-8","108-67-8","75-01-4","1330-20-7"]
["EPA Vapor Intrusion Screening Levels (VISLs) (µg/m3)",null,null,"Tracer (show value)","NE","NE",0.69499999999999995,1.38,12,2090,2.5299999999999998,85.1,174,3.12,"NE","NE","NE",15.6,24300,1740,"NE",139000,4.07,3130,209000,"NE","NE",5.6299999999999996E-3,0.156,139,6950,"NE",8.51,3480,58.5,3.6,6950,"NE",1390,25.3,"NE","NE","NE","NE","NE",10.4,24300,37.4,"NE",4.25,24300,13900,"NE",174000,"NE",3380,104000,360,2.75,104000,34800,34800,12.6,1.61,174000,360,174000,"NE",69.5,174000,5.85,15.9,"NE",10.4,2090,2090,2090,5.59,3480]
[null,null,null,{"$f":"IFERROR(_xlfn.IFS(SUM(D8:D5000)>0,\"\",COUNTIF(D8:D5000,\"*\"&\" \"&\"*\"),\"\"),\"X\")","v":"X"},{"$f":"IFERROR(_xlfn.IFS(SUM(E8:E5000)>0,\"\",COUNTIF(E8:E5000,\"*\"&\" \"&\"*\"),\"\"),\"X\")","v":"X"},"X","X","X","X","X","X","X","X","X","X","X","X","X","X","X","X","X","X","X","X","X","X","X","X","X","X","X","X","X","X","X","X","X","X","X","X","X","X","X","X","X","X","X","X","X","X","X","X","X","X","X","X","X","X","X","X","X","X","X","X","X","X","X",{"$f":"IFERROR(_xlfn.IFS(SUM(BQ8:BQ5000)>0,\"\",COUNTIF(BQ8:BQ5000,\"*\"&\" \"&\"*\"),\"\"),\"X\")","v":"X"},"X","X","X","X","X","X","X","X","X","X"]
[]
[]
[]
[]
[]
[]
[]
[]
[]
[]
[]
[]
[]
[]
[]
[]
[]
[]
[]
[]
[]
[]
[]
[]
[]
[]
[]
[]
[]
[]
[]
[]
[]
[]
[]
[]
[]
[]
[]
[]
[]
[]
[]
[]
["Insert rows between the last line of data and the last line of the table. Highlight the number of rows needed, right-click, go to insert."]
["DO NOT ctrl-V when pasting data into the table, right-click and PASTE VALUES"]

{"sheet":"GW Elevations & Gradient","index":7,"n_rows":2000,"n_cols":19,"rows_kept":2000,"cut":false,"hidden":false,"merged":[[36,13,36,14],[37,13,37,14],[38,13,38,14],[31,13,31,14],[32,13,32,14],[33,13,33,14],[34,13,34,14],[35,13,35,14],[1,2,1,9],[0,1,0,9],[28,13,28,14],[29,13,29,14],[30,13,30,14]]}
[null,"Groundwater Elevations"]
[null,"Notes: ","Insert well elevation and screen information in the table to the right."]
[null,"Well ID","Gauging Date","Depth to Water\n(ft. TOC-N)","Depth to Product (ft. TOC-N)","Product Thickness (ft)","Product Type","Water Table Elevation, Corrected for Product Thickness (ft amsl)","GW Above TOS","GW Column Above BOS (ft)"]
[{"$f":"CONCATENATE(B4,C4)","v":""},null,null,null,null,null,null,null,null,null,null,"Well ID","TOC Elevation","TOS Elev.","BOS Elev.","TOS Depth","BOS Depth"]
[{"$f":"CONCATENATE(B5,C5)","v":""},null,null,null,null,null,null,null,null,null,null,null,null,null,null,null,null,null,"Insert rows between the last line of data and the last line of the table. Highlight the number of rows needed, right-click, go to insert. Drag down formulas."]
["",null,null,null,null,null,null,null,null,null,null,null,null,null,null,null,null,null,"DO NOT ctrl-V when pasting data into the table, right-click and PASTE VALUES"]
[""]
[""]
[""]
[""]
[""]
[""]
[""]
[""]
[""]
[""]
[""]
[""]
[""]
[""]
[""]
[""]
[""]
[""]
[""]
[""]
[""]
[""]
["",null,null,null,null,null,null,null,null,null,null,"Date","Flow Direction","Gradient Range"]
[""]
[""]
[""]
[""]
[""]
[""]
[""]
[""]
[""]
[""]
[""]
[""]
[""]
[""]
[""]
[""]
[""]
[""]
[""]
[""]
[""]
[""]
[""]
[""]
[""]
[""]
[""]
[""]
[""]
[""]
[""]
[""]
[""]
[""]
[""]
[""]
[""]
[""]
[""]
[{"$f":"CONCATENATE(B69,C69)","v":""}]
[""]
[""]
[""]
[""]
[""]
[""]
[""]
[""]
[""]
[""]
["",null,null,null,null,null,null,null,null,null,null,null,null,null,null,null,null,"END OF PAGE BREAK"]
[""]
[""]
[""]
[""]
[""]
[""]
[""]
[""]
[""]
[""]
[""]
[""]
[""]
[""]
[""]
[""]
[""]
[""]
[""]
[""]
[""]
[""]
[""]
[""]
[""]
[""]
[""]
[""]
[""]
[""]
[""]
[""]
[""]
[""]
[""]
[""]
[""]
[""]
[""]
[""]
[""]
[""]
[""]
[""]
[""]
[""]
[""]
[""]
[""]
[""]
[""]
[""]
[{"$f":"CONCATENATE(B133,C133)","v":""}]
[""]
[""]
[""]
[""]
[""]
[""]
[""]
[""]
[""]
[""]
[""]
[""]
[""]
[""]
[""]
[""]
[""]
[""]
[""]
[""]
[""]
[""]
[""]
[""]
[""]
[""]
[""]
[""]
[""]
[""]
[""]
[""]
[""]
[""]
[""]
[""]
[""]
[""]
[""]
[""]
[""]
[""]
[""]
[""]
[""]
[""]
[""]
[""]
[""]
[""]
[""]
[""]
[""]
[""]
[""]
[""]
[""]
[""]
[""]
[""]
[""]
[""]
[""]
[{"$f":"CONCATENATE(B197,C197)","v":""}]
[""]
[""]
[""]
[""]
[""]
[""]
[""]
[""]
[""]
[""]
[""]
[""]
[""]
[""]
[""]
[""]
[""]
[""]
[""]
[""]
[""]
[""]
[""]
[""]
[""]
[""]
[""]
[""]
[""]
[""]
[""]
[""]
[""]
[""]
[""]
[""]
[""]
[""]
[""]
[""]
[""]
[""]
[""]
[""]
[""]
[""]
[""]
[""]
[""]
[""]
[""]
[""]
[""]
[""]
[""]
[""]
[""]
[""]
[""]
[""]
[""]
[""]
[""]
[{"$f":"CONCATENATE(B261,C261)","v":""}]
[""]
[""]
[""]
[""]
[""]
[""]
[""]
[""]
[""]
[""]
[""]
[""]
[""]
[""]
[""]
[""]
[""]
[""]
[""]
[""]
[""]
[""]
[""]
[""]
[""]
[""]
[""]
[""]
[""]
[""]
[""]
[""]
[""]
[""]
[""]
[""]
[""]
[""]
[""]
[""]
[""]
[""]
[""]
[""]
[""]
[""]
[""]
[""]
[""]
[""]
[""]
[""]
[""]
[""]
[""]
[""]
[""]
[""]
[""]
[""]
[""]
[""]
[""]
[{"$f":"CONCATENATE(B325,C325)","v":""}]
[""]
[""]
[""]
[""]
[""]
[""]
[""]
[""]
[""]
[""]
[""]
[""]
[""]
[""]
[""]
[""]
[""]
[""]
[""]
[""]
[""]
[""]
[""]
[""]
[""]
[""]
[""]
[""]
[""]
[""]
[""]
[""]
[""]
[""]
[""]
[""]
[""]
[""]
[""]
[""]
[""]
[""]
[""]
[""]
[""]
[""]
[""]
[""]
[""]
[""]
[""]
[""]
[""]
[""]
[""]
[""]
[""]
[""]
[""]
[""]
[""]
[""]
[""]
[{"$f":"CONCATENATE(B389,C389)","v":""}]
[""]
[""]
[""]
[""]
[""]
[""]
[""]
[""]
[""]
[""]
[""]
[""]
[""]
[""]
[""]
[""]
[""]
[""]
[""]
[""]
[""]
[""]
[""]
[""]
[""]
[""]
[""]
[""]
[""]
[""]
[""]
[""]
[""]
[""]
[""]
[""]
[""]
[""]
[""]
[""]
[""]
[""]
[""]
[""]
[""]
[""]
[""]
[""]
[""]
[""]
[""]
[""]
[""]
[""]
[""]
[""]
[""]
[""]
[""]
[""]
[""]
[""]
[""]
[{"$f":"CONCATENATE(B453,C453)","v":""}]
[""]
[""]
[""]
[""]
[""]
[""]
[""]
[""]
[""]
[""]
[""]
[""]
[""]
[""]
[""]
[""]
[""]
[""]
[""]
[""]
[""]
[""]
[""]
[""]
[""]
[""]
[""]
[""]
[""]
[""]
[""]
[""]
[""]
[""]
[""]
[""]
[""]
[""]
[""]
[""]
[""]
[""]
[""]
[""]
[""]
[""]
[""]
[""]
[""]
[""]
[""]
[""]
[""]
[""]
[""]
[""]
[""]
[""]
[""]
[""]
[""]
[""]
[""]
[{"$f":"CONCATENATE(B517,C517)","v":""}]
[""]
[""]
[""]
[""]
[""]
[""]
[""]
[""]
[""]
[""]
[""]
[""]
[""]
[""]
[""]
[""]
[""]
[""]
[""]
[""]
[""]
[""]
[""]
[""]
[""]
[""]
[""]
[""]
[""]
[""]
[""]
[""]
[""]
[""]
[""]
[""]
[""]
[""]
[""]
[""]
[""]
[""]
[""]
[""]
[""]
[""]
[""]
[""]
[""]
[""]
[""]
[""]
[""]
[""]
[""]
[""]
[""]
[""]
[""]
[""]
[""]
[""]
[""]
[{"$f":"CONCATENATE(B581,C581)","v":""}]
[""]
[""]
[""]
[""]
[""]
[""]
[""]
[""]
[""]
[""]
[""]
[""]
[""]
[""]
[""]
[""]
[""]
[""]
[""]
[""]
[""]
[""]
[""]
[""]
[""]
[""]
[""]
[""]
[""]
[""]
[""]
[""]
[""]
[""]
[""]
[""]
[""]
[""]
[""]
[""]
[""]
[""]
[""]
[""]
[""]
[""]
[""]
[""]
[""]
[""]
[""]
[""]
[""]
[""]
[""]
[""]
[""]
[""]
[""]
[""]
[""]
[""]
[""]
[{"$f":"CONCATENATE(B645,C645)","v":""}]
[""]
[""]
[""]
[""]
[""]
[""]
[""]
[""]
[""]
[""]
[""]
[""]
[""]
[""]
[""]
[""]
[""]
[""]
[""]
[""]
[""]
[""]
[""]
[""]
[""]
[""]
[""]
[""]
[""]
[""]
[""]
[""]
[""]
[""]
[""]
[""]
[""]
[""]
[""]
[""]
[""]
[""]
[""]
[""]
[""]
[""]
[""]
[""]
[""]
[""]
[""]
[""]
[""]
[""]
[""]
[""]
[""]
[""]
[""]
[""]
[""]
[""]
[""]
[{"$f":"CONCATENATE(B709,C709)","v":""}]
[""]
[""]
[""]
[""]
[""]
[""]
[""]
[""]
[""]
[""]
[""]
[""]
[""]
[""]
[""]
[""]
[""]
[""]
[""]
[""]
[""]
[""]
[""]
[""]
[""]
[""]
[""]
[""]
[""]
[""]
[""]
[""]
[""]
[""]
[""]
[""]
[""]
[""]
[""]
[""]
[""]
[""]
[""]
[""]
[""]
[""]
[""]
[""]
[""]
[""]
[""]
[""]
[""]
[""]
[""]
[""]
[""]
[""]
[""]
[""]
[""]
[""]
[""]
[{"$f":"CONCATENATE(B773,C773)","v":""}]
[""]
[""]
[""]
[""]
[""]
[""]
[""]
[""]
[""]
[""]
[""]
[""]
[""]
[""]
[""]
[""]
[""]
[""]
[""]
[""]
[""]
[""]
[""]
[""]
[""]
[""]
[""]
[""]
[""]
[""]
[""]
[""]
[""]
[""]
[""]
[""]
[""]
[""]
[""]
[""]
[""]
[""]
[""]
[""]
[""]
[""]
[""]
[""]
[""]
[""]
[""]
[""]
[""]
[""]
[""]
[""]
[""]
[""]
[""]
[""]
[""]
[""]
[""]
[{"$f":"CONCATENATE(B837,C837)","v":""}]
[""]
[""]
[""]
[""]
[""]
[""]
[""]
[""]
[""]
[""]
[""]
[""]
[""]
[""]
[""]
[""]
[""]
[""]
[""]
[""]
[""]
[""]
[""]
[""]
[""]
[""]
[""]
[""]
[""]
[""]
[""]
[""]
[""]
[""]
[""]
[""]
[""]
[""]
[""]
[""]
[""]
[""]
[""]
[""]
[""]
[""]
[""]
[""]
[""]
[""]
[""]
[""]
[""]
[""]
[""]
[""]
[""]
[""]
[""]
[""]
[""]
[""]
[""]
[{"$f":"CONCATENATE(B901,C901)","v":""}]
[""]
[""]
[""]
[""]
[""]
[""]
[""]
[""]
[""]
[""]
[""]
[""]
[""]
[""]
[""]
[""]
[""]
[""]
[""]
[""]
[""]
[""]
[""]
[""]
[""]
[""]
[""]
[""]
[""]
[""]
[""]
[""]
[""]
[""]
[""]
[""]
[""]
[""]
[""]
[""]
[""]
[""]
[""]
[""]
[""]
[""]
[""]
[""]
[""]
[""]
[""]
[""]
[""]
[""]
[""]
[""]
[""]
[""]
[""]
[""]
[""]
[""]
[""]
[{"$f":"CONCATENATE(B965,C965)","v":""}]
[""]
[""]
[""]
[""]
[""]
[""]
[""]
[""]
[""]
[""]
[""]
[""]
[""]
[""]
[""]
[""]
[""]
[""]
[""]
[""]
[""]
[""]
[""]
[""]
[""]
[""]
[""]
[""]
[""]
[""]
[""]
[""]
[""]
[""]
[""]
[""]
[""]
[""]
[""]
[""]
[""]
[""]
[""]
[""]
[""]
[""]
[""]
[""]
[""]
[""]
[""]
[""]
[""]
[""]
[""]
[""]
[""]
[""]
[""]
[""]
[""]
[""]
[""]
[{"$f":"CONCATENATE(B1029,C1029)","v":""}]
[""]
[""]
[""]
[""]
[""]
[""]
[""]
[""]
[""]
[""]
[""]
[""]
[""]
[""]
[""]
[""]
[""]
[""]
[""]
[""]
[""]
[""]
[""]
[""]
[""]
[""]
[""]
[""]
[""]
[""]
[""]
[""]
[""]
[""]
[""]
[""]
[""]
[""]
[""]
[""]
[""]
[""]
[""]
[""]
[""]
[""]
[""]
[""]
[""]
[""]
[""]
[""]
[""]
[""]
[""]
[""]
[""]
[""]
[""]
[""]
[""]
[""]
[""]
[{"$f":"CONCATENATE(B1093,C1093)","v":""}]
[""]
[""]
[""]
[""]
[""]
[""]
[""]
[""]
[""]
[""]
[""]
[""]
[""]
[""]
[""]
[""]
[""]
[""]
[""]
[""]
[""]
[""]
[""]
[""]
[""]
[""]
[""]
[""]
[""]
[""]
[""]
[""]
[""]
[""]
[""]
[""]
[""]
[""]
[""]
[""]
[""]
[""]
[""]
[""]
[""]
[""]
[""]
[""]
[""]
[""]
[""]
[""]
[""]
[""]
[""]
[""]
[""]
[""]
[""]
[""]
[""]
[""]
[""]
[{"$f":"CONCATENATE(B1157,C1157)","v":""}]
[""]
[""]
[""]
[""]
[""]
[""]
[""]
[""]
[""]
[""]
[""]
[""]
[""]
[""]
[""]
[""]
[""]
[""]
[""]
[""]
[""]
[""]
[""]
[""]
[""]
[""]
[""]
[""]
[""]
[""]
[""]
[""]
[""]
[""]
[""]
[""]
[""]
[""]
[""]
[""]
[""]
[""]
[""]
[""]
[""]
[""]
[""]
[""]
[""]
[""]
[""]
[""]
[""]
[""]
[""]
[""]
[""]
[""]
[""]
[""]
[""]
[""]
[""]
[{"$f":"CONCATENATE(B1221,C1221)","v":""}]
[""]
[""]
[""]
[""]
[""]
[""]
[""]
[""]
[""]
[""]
[""]
[""]
[""]
[""]
[""]
[""]
[""]
[""]
[""]
[""]
[""]
[""]
[""]
[""]
[""]
[""]
[""]
[""]
[""]
[""]
[""]
[""]
[""]
[""]
[""]
[""]
[""]
[""]
[""]
[""]
[""]
[""]
[""]
[""]
[""]
[""]
[""]
[""]
[""]
[""]
[""]
[""]
[""]
[""]
[""]
[""]
[""]
[""]
[""]
[""]
[""]
[""]
[""]
[{"$f":"CONCATENATE(B1285,C1285)","v":""}]
[""]
[""]
[""]
[""]
[""]
[""]
[""]
[""]
[""]
[""]
[""]
[""]
[""]
[""]
[""]
[""]
[""]
[""]
[""]
[""]
[""]
[""]
[""]
[""]
[""]
[""]
[""]
[""]
[""]
[""]
[""]
[""]
[""]
[""]
[""]
[""]
[""]
[""]
[""]
[""]
[""]
[""]
[""]
[""]
[""]
[""]
[""]
[""]
[""]
[""]
[""]
[""]
[""]
[""]
[""]
[""]
[""]
[""]
[""]
[""]
[""]
[""]
[""]
[{"$f":"CONCATENATE(B1349,C1349)","v":""}]
[""]
[""]
[""]
[""]
[""]
[""]
[""]
[""]
[""]
[""]
[""]
[""]
[""]
[""]
[""]
[""]
[""]
[""]
[""]
[""]
[""]
[""]
[""]
[""]
[""]
[""]
[""]
[""]
[""]
[""]
[""]
[""]
[""]
[""]
[""]
[""]
[""]
[""]
[""]
[""]
[""]
[""]
[""]
[""]
[""]
[""]
[""]
[""]
[""]
[""]
[""]
[""]
[""]
[""]
[""]
[""]
[""]
[""]
[""]
[""]
[""]
[""]
[""]
[{"$f":"CONCATENATE(B1413,C1413)","v":""}]
[""]
[""]
[""]
[""]
[""]
[""]
[""]
[""]
[""]
[""]
[""]
[""]
[""]
[""]
[""]
[""]
[""]
[""]
[""]
[""]
[""]
[""]
[""]
[""]
[""]
[""]
[""]
[""]
[""]
[""]
[""]
[""]
[""]
[""]
[""]
[""]
[""]
[""]
[""]
[""]
[""]
[""]
[""]
[""]
[""]
[""]
[""]
[""]
[""]
[""]
[""]
[""]
[""]
[""]
[""]
[""]
[""]
[""]
[""]
[""]
[""]
[""]
[""]
[{"$f":"CONCATENATE(B1477,C1477)","v":""}]
[""]
[""]
[""]
[""]
[""]
[""]
[""]
[""]
[""]
[""]
[""]
[""]
[""]
[""]
[""]
[""]
[""]
[""]
[""]
[""]
[""]
[""]
[""]
[""]
[""]
[""]
[""]
[""]
[""]
[""]
[""]
[""]
[""]
[""]
[""]
[""]
[""]
[""]
[""]
[""]
[""]
[""]
[""]
[""]
[""]
[""]
[""]
[""]
[""]
[""]
[""]
[""]
[""]
[""]
[""]
[""]
[""]
[""]
[""]
[""]
[""]
[""]
[""]
[{"$f":"CONCATENATE(B1541,C1541)","v":""}]
[""]
[""]
[""]
[""]
[""]
[""]
[""]
[""]
[""]
[""]
[""]
[""]
[""]
[""]
[""]
[""]
[""]
[""]
[""]
[""]
[""]
[""]
[""]
[""]
[""]
[""]
[""]
[""]
[""]
[""]
[""]
[""]
[""]
[""]
[""]
[""]
[""]
[""]
[""]
[""]
[""]
[""]
[""]
[""]
[""]
[""]
[""]
[""]
[""]
[""]
[""]
[""]
[""]
[""]
[""]
[""]
[""]
[""]
[""]
[""]
[""]
[""]
[""]
[{"$f":"CONCATENATE(B1605,C1605)","v":""}]
[""]
[""]
[""]
[""]
[""]
[""]
[""]
[""]
[""]
[""]
[""]
[""]
[""]
[""]
[""]
[""]
[""]
[""]
[""]
[""]
[""]
[""]
[""]
[""]
[""]
[""]
[""]
[""]
[""]
[""]
[""]
[""]
[""]
[""]
[""]
[""]
[""]
[""]
[""]
[""]
[""]
[""]
[""]
[""]
[""]
[""]
[""]
[""]
[""]
[""]
[""]
[""]
[""]
[""]
[""]
[""]
[""]
[""]
[""]
[""]
[""]
[""]
[""]
[{"$f":"CONCATENATE(B1669,C1669)","v":""}]
[""]
[""]
[""]
[""]
[""]
[""]
[""]
[""]
[""]
[""]
[""]
[""]
[""]
[""]
[""]
[""]
[""]
[""]
[""]
[""]
[""]
[""]
[""]
[""]
[""]
[""]
[""]
[""]
[""]
[""]
[""]
[""]
[""]
[""]
[""]
[""]
[""]
[""]
[""]
[""]
[""]
[""]
[""]
[""]
[""]
[""]
[""]
[""]
[""]
[""]
[""]
[""]
[""]
[""]
[""]
[""]
[""]
[""]
[""]
[""]
[""]
[""]
[""]
[{"$f":"CONCATENATE(B1733,C1733)","v":""}]
[""]
[""]
[""]
[""]
[""]
[""]
[""]
[""]
[""]
[""]
[""]
[""]
[""]
[""]
[""]
[""]
[""]
[""]
[""]
[""]
[""]
[""]
[""]
[""]
[""]
[""]
[""]
[""]
[""]
[""]
[""]
[""]
[""]
[""]
[""]
[""]
[""]
[""]
[""]
[""]
[""]
[""]
[""]
[""]
[""]
[""]
[""]
[""]
[""]
[""]
[""]
[""]
[""]
[""]
[""]
[""]
[""]
[""]
[""]
[""]
[""]
[""]
[""]
[{"$f":"CONCATENATE(B1797,C1797)","v":""}]
[""]
[""]
[""]
[""]
[""]
[""]
[""]
[""]
[""]
[""]
[""]
[""]
[""]
[""]
[""]
[""]
[""]
[""]
[""]
[""]
[""]
[""]
[""]
[""]
[""]
[""]
[""]
[""]
[""]
[""]
[""]
[""]
[""]
[""]
[""]
[""]
[""]
[""]
[""]
[""]
[""]
[""]
[""]
[""]
[""]
[""]
[""]
[""]
[""]
[""]
[""]
[""]
[""]
[""]
[""]
[""]
[""]
[""]
[""]
[""]
[""]
[""]
[""]
[{"$f":"CONCATENATE(B1861,C1861)","v":""}]
[""]
[""]
[""]
[""]
[""]
[""]
[""]
[""]
[""]
[""]
[""]
[""]
[""]
[""]
[""]
[""]
[""]
[""]
[""]
[""]
[""]
[""]
[""]
[""]
[""]
[""]
[""]
[""]
[""]
[""]
[""]
[""]
[""]
[""]
[""]
[""]
[""]
[""]
[""]
[""]
[""]
[""]
[""]
[""]
[""]
[""]
[""]
[""]
[""]
[""]
[""]
[""]
[""]
[""]
[""]
[""]
[""]
[""]
[""]
[""]
[""]
[""]
[""]
[{"$f":"CONCATENATE(B1925,C1925)","v":""}]
[""]
[""]
[""]
[""]
[""]
[""]
[""]
[""]
[""]
[""]
[""]
[""]
[""]
[""]
[""]
[""]
[""]
[""]
[""]
[""]
[""]
[""]
[""]
[""]
[""]
[""]
[""]
[""]
[""]
[""]
[""]
[""]
[""]
[""]
[""]
[""]
[""]
[""]
[""]
[""]
[""]
[""]
[""]
[""]
[""]
[""]
[""]
[""]
[""]
[""]
[""]
[""]
[""]
[""]
[""]
[""]
[""]
[""]
[""]
[""]
[""]
[""]
[""]
[{"$f":"CONCATENATE(B1989,C1989)","v":""}]
[""]
[""]
[""]
[""]
[""]
[""]
[""]
[""]
[""]
[""]
[""]

{"sheet":"GW VOCs Table","index":8,"n_rows":2001,"n_cols":87,"rows_kept":2001,"cut":false,"hidden":false,"merged":[[1,2,1,84],[0,1,0,84],[2,11,2,84],[2,10,3,10],[2,3,3,3],[2,1,3,1],[2,2,3,2],[2,4,3,4]]}
[null,"Groundwater VOC Data Table",null,null,null,null,null,null,null,null,null,null,null,null,null,null,null,null,null,null,null,null,null,null,null,null,null,null,null,null,null,null,null,null,null,null,null,null,null,null,null,null,null,null,null,null,null,null,null,null,null,null,null,null,null,null,null,null,null,null,null,null,null,null,null,null,null,null,null,null,null,null,null,null,null,null,null,null,null,null,null,null,null,null,null,"Insert rows between the last line of data and the last line of the table. Highlight the number of rows needed, right-click, go to insert."]
[null,"Notes: ","If a result is less than the detection limit, input \"<\" followed by the detection limit. If the compound does not have a laboratory detection or laboratory limit (example: some labs may not have a detection/reporting limit for certain TICs), then input “ND”. If a compound is not analyzed, input \"NA\".",null,null,null,null,null,null,null,null,null,null,null,null,null,null,null,null,null,null,null,null,null,null,null,null,null,null,null,null,null,null,null,null,null,null,null,null,null,null,null,null,null,null,null,null,null,null,null,null,null,null,null,null,null,null,null,null,null,null,null,null,null,null,null,null,null,null,null,null,null,null,null,null,null,null,null,null,null,null,null,null,null,null,"DO NOT ctrl-V when pasting data into the table, right-click and PASTE VALUES"]
[null,"Well ID","Sample Type","Sample Depth \n(feet below water table)","Depth to Water\n(ft bmp)",null,null,null,null,null,"Sample Date","EPA Method 8260B, Full VOCs List (µg/L)"]
[null,null,null,null,null,"Top of Casing Elevation (ft asl)","Groundwater Elevation (ft asl)","Free Product Thickness (ft)","GW Above TOS","GW Column Above BOS (ft)",null,"Acetone","Acrolein","Acrylonitrile","Benzene","Bromobenzene","Bromodichloromethane","Bromoform","Bromomethane","1,3-Butadiene","n-Butylbenzene","sec-Butylbenzene","tert-Butylbenzene","Carbon Tetrachloride","Carbon disulfide","Chlorobenzene","Chlorodibromomethane","Chloroethane","Chloroform","Chloromethane","Cyclohexane","2-Chlorotoluene","4-Chlorotoluene","1,2-Dibromo-3-Chloropropane","1,2-Dibromoethane (EDB)","Dibromomethane","1,2-Dichlorobenzene","1,3-Dichlorobenzene","1,4-Dichlorobenzene","Dichlorodifluoromethane","1,1-Dichloroethane","1,2-Dichloroethane (1,2-DCA)","1,1-Dichloroethene","cis-1,2-Dichloroethene","trans-1,2-Dichloroethene","1,2-Dichloropropane","1,1-Dichloropropene","1,3-Dichloropropane","cis-1,3-Dichloropropene","trans-1,3-Dichloropropene","2,2-Dichloropropane","Dicyclopentadiene","Di-isopropyl ether","Ethylbenzene","4-Ethyltoluene","Hexachloro-1,3-butadiene","n-Hexane","Isopropylbenzene (cumene)","p-Isopropyltoluene (cymene)","2-Butanone (MEK)","Methyl Cyclohexane","Methylene Chloride","4-Methyl-2-pentanone (MIBK)","Methyl tert-butyl ether (MTBE)","Naphthalene","Propene","n-Propylbenzene","Styrene","1,1,1,2-Tetrachloroethane","1,1,2,2-Tetrachloroethane","1,1,2-Trichlorotrifluoroethane","Tetrachloroethene","Toluene","1,2,3-Trichlorobenzene","1,2,4-Trichlorobenzene","1,1,1-Trichloroethane","1,1,2-Trichloroethane","Trichloroethene","Trichlorofluoromethane","1,2,3-Trichloropropane","1,2,4-Trimethylbenzene","1,2,3-Trimethylbenzene","1,3,5-Trimethylbenzene","Vinyl chloride","Xylenes, total"]
[null,null,null,null,null,null,null,null,null,null,null,{"$f":"IFERROR(_xlfn.IFS(SUM(L9:L5001)>0,\"\",COUNTIF(L9:L5001,\"*\"&\" \"&\"*\"),\"\"),\"X\")","v":"X"},"X","X","X","X","X","X","X","X","X","X","X","X","X","X","X","X","X","X","X","X","X","X","X","X","X","X","X","X","X","X","X",{"$f":"IFERROR(_xlfn.IFS(SUM(AR9:AR5001)>0,\"\",COUNTIF(AR9:AR5001,\"*\"&\" \"&\"*\"),\"\"),\"X\")","v":"X"},"X","X","X","X","X","X","X","X","X","X","X","X","X","X","X","X","X","X","X","X","X","X","X","X","X","X","X","X","X","X","X",{"$f":"IFERROR(_xlfn.IFS(SUM(BX9:BX5001)>0,\"\",COUNTIF(BX9:BX5001,\"*\"&\" \"&\"*\"),\"\"),\"X\")","v":"X"},"X","X","X","X","X","X","X","X","X"]
[null,"CAS Numbers",null,null,null,null,null,null,null,null,null,"67-64-1 ","107-02-8 ","107-13-1 ","71-43-2 ","108-86-1 ","75-27-4 ","75-25-2 ","74-83-9 ","106-99-0 ","104-51-8 ","135-98-8 ","98-06-6 ","56-23-5 ","75-15-0 ","108-90-7 ","124-48-1 ","75-00-3 ","67-66-3 ","74-87-3 ","110-82-7 ","95-49-8 ","106-43-4","96-12-8 ","106-93-4 ","74-95-3 ","95-50-1 ","541-73-1 ","106-46-7 ","75-71-8 ","75-34-3 ","107-06-2 ","75-35-4 ","156-59-2 ","156-60-5 ","78-87-5 ","563-58-6","142-28-9 ","10061-01-5","10061-02-6","594-20-7","77-73-6 ","108-20-3","100-41-4 ","622-96-8","87-68-3 ","110-54-3 ","98-82-8 ","99-87-6","78-93-3 ","108-87-2 ","75-09-2 ","108-10-1","1634-04-4 ","91-20-3 ","115-07-1","103-65-1 ","100-42-5 ","630-20-6 ","79-34-5 ","76-13-1 ","127-18-4 ","108-88-3 ","87-61-6","120-82-1 ","71-55-6 ","79-00-5 ","79-01-6 ","75-69-4 ","96-18-4 ","95-63-6 ","526-73-8","108-67-8 ","75-01-4 ","1330-20-7 "]
[null,"ADEQ Release Confirmation Levels (RCLs) (µg/L)",null,null,null,null,null,null,null,null,null,"NE","NE","NE",2,"NE","NE","NE","NE",2,5,5,5,"NE",9.1,"NE","NE","NE","NE","NE",2,"NE","NE","NE",2,"NE","NE","NE","NE","NE","NE",2,"NE","NE","NE","NE","NE","NE","NE","NE","NE",10,"NE",2,10,"NE",10,2,2,"NE",10,"NE","NE",1,5,10,2,"NE","NE","NE","NE","NE",5,"NE","NE","NE","NE","NE","NE","NE",2,"NE",2,"NE",3]
[null,"Aquifer Water Quality Standards (µg/L)",null,null,null,null,null,null,null,null,null,"NE","NE","NE",5,"NE","NE","NE","NE","NE","NE","NE","NE",5,"NE",100,"NE","NE","NE","NE","NE","NE","NE",0.2,0.05,"NE",600,"NE",75,"NE","NE",5,7,70,100,5,"NE","NE","NE","NE","NE","NE","NE",700,"NE","NE","NE","NE","NE","NE","NE",5,"NE",94,"NE","NE","NE",100,"NE","NE","NE",5,1000,"NE",70,200,5,5,"NE","NE","NE","NE","NE",2,10000]
[{"$f":"CONCATENATE(B9,K9)","v":""}]
[{"$f":"CONCATENATE(B10,K10)","v":""}]
[""]
[""]
[""]
[""]
[""]
[""]
[""]
[""]
[""]
[""]
[""]
[""]
[""]
[""]
[""]
[""]
[""]
[""]
[""]
[""]
[""]
[""]
[""]
[""]
[""]
[""]
[""]
[""]
[""]
[""]
[""]
[""]
[""]
[""]
[""]
[""]
[""]
[""]
[""]
[""]
[""]
["",null,null,null,null,null,null,null,null,null,null,null,null,null,null,null,null,null,null,null,null,null,null,null,null,null,null,null,null,null,null,null,null,null,null,null,null,null,null,null,null,null,null,null,null,null,null,null,null,null,null,null,null,null,null,null,null,null,null,null,null,null,null,null,null,null,null,null,null,null,null,null,null,null,null,null,null,null,null,null,null,null,null,null,null,null,"END OF FIRST PAGE BREAK"]
[""]
[""]
[""]
[""]
[""]
[""]
[""]
[""]
[""]
[""]
[""]
[""]
[""]
[""]
[""]
[""]
[""]
[""]
[""]
[""]
[""]
[{"$f":"CONCATENATE(B74,K74)","v":""}]
[""]
[""]
[""]
[""]
[""]
[""]
[""]
[""]
[""]
[""]
[""]
[""]
[""]
[""]
[""]
[""]
[""]
[""]
[""]
[""]
[""]
["",null,null,null,null,null,null,null,null,null,null,null,null,null,null,null,null,null,null,null,null,null,null,null,null,null,null,null,null,null,null,null,null,null,null,null,null,null,null,null,null,null,null,null,null,null,null,null,null,null,null,null,null,null,null,null,null,null,null,null,null,null,null,null,null,null,null,null,null,null,null,null,null,null,null,null,null,null,null,null,null,null,null,null,null,null,"END OF SECOND PAGE BREAK"]
[""]
[""]
[""]
[""]
[""]
[""]
[""]
[""]
[""]
[""]
[""]
[""]
[""]
[""]
[""]
[""]
[""]
[""]
[""]
[""]
[""]
[""]
[""]
[""]
[""]
[""]
[""]
[""]
[""]
[""]
[""]
[""]
[""]
[""]
[""]
[""]
[""]
[""]
[""]
[""]
[""]
[{"$f":"CONCATENATE(B138,K138)","v":""}]
[""]
[""]
[""]
[""]
[""]
[""]
[""]
[""]
[""]
[""]
[""]
[""]
[""]
[""]
[""]
[""]
[""]
[""]
[""]
[""]
[""]
[""]
[""]
[""]
[""]
[""]
[""]
[""]
[""]
[""]
[""]
[""]
[""]
[""]
[""]
[""]
[""]
[""]
[""]
[""]
[""]
[""]
[""]
[""]
[""]
[""]
[""]
[""]
[""]
[""]
[""]
[""]
[""]
[""]
[""]
[""]
[""]
[""]
[""]
[""]
[""]
[""]
[""]
[{"$f":"CONCATENATE(B202,K202)","v":""}]
[""]
[""]
[""]
[""]
[""]
[""]
[""]
[""]
[""]
[""]
[""]
[""]
[""]
[""]
[""]
[""]
[""]
[""]
[""]
[""]
[""]
[""]
[""]
[""]
[""]
[""]
[""]
[""]
[""]
[""]
[""]
[""]
[""]
[""]
[""]
[""]
[""]
[""]
[""]
[""]
[""]
[""]
[""]
[""]
[""]
[""]
[""]
[""]
[""]
[""]
[""]
[""]
[""]
[""]
[""]
[""]
[""]
[""]
[""]
[""]
[""]
[""]
[""]
[{"$f":"CONCATENATE(B266,K266)","v":""}]
[""]
[""]
[""]
[""]
[""]
[""]
[""]
[""]
[""]
[""]
[""]
[""]
[""]
[""]
[""]
[""]
[""]
[""]
[""]
[""]
[""]
[""]
[""]
[""]
[""]
[""]
[""]
[""]
[""]
[""]
[""]
[""]
[""]
[""]
[""]
[""]
[""]
[""]
[""]
[""]
[""]
[""]
[""]
[""]
[""]
[""]
[""]
[""]
[""]
[""]
[""]
[""]
[""]
[""]
[""]
[""]
[""]
[""]
[""]
[""]
[""]
[""]
[""]
[{"$f":"CONCATENATE(B330,K330)","v":""}]
[""]
[""]
[""]
[""]
[""]
[""]
[""]
[""]
[""]
[""]
[""]
[""]
[""]
[""]
[""]
[""]
[""]
[""]
[""]
[""]
["Insert rows between the last line of data and the last line of the table. Highlight the number of rows needed, right-click, go to insert.","Insert rows between the last line of data and the last line of the table. Highlight the number of rows needed, right-click, go to insert."]
["DO NOT ctrl-V when pasting data into the table, right-click and PASTE VALUES","DO NOT ctrl-V when pasting data into the table, right-click and PASTE VALUES"]
[""]
[""]
[""]
[""]
[""]
[""]
[""]
[""]
[""]
[""]
[""]
[""]
[""]
[""]
[""]
[""]
[""]
[""]
[""]
[""]
[""]
[""]
[""]
[""]
[""]
[""]
[""]
[""]
[""]
[""]
[""]
[""]
[""]
[""]
[""]
[""]
[""]
[""]
[""]
[""]
[""]
[{"$f":"CONCATENATE(B394,K394)","v":""}]
[""]
[""]
[""]
[""]
[""]
[""]
[""]
[""]
[""]
[""]
[""]
[""]
[""]
[""]
[""]
[""]
[""]
[""]
[""]
[""]
[""]
[""]
[""]
[""]
[""]
[""]
[""]
[""]
[""]
[""]
[""]
[""]
[""]
[""]
[""]
[""]
[""]
[""]
[""]
[""]
[""]
[""]
[""]
[""]
[""]
[""]
[""]
[""]
[""]
[""]
[""]
[""]
[""]
[""]
[""]
[""]
[""]
[""]
[""]
[""]
[""]
[""]
[""]
[{"$f":"CONCATENATE(B458,K458)","v":""}]
[""]
[""]
[""]
[""]
[""]
[""]
[""]
[""]
[""]
[""]
[""]
[""]
[""]
[""]
[""]
[""]
[""]
[""]
[""]
[""]
[""]
[""]
[""]
[""]
[""]
[""]
[""]
[""]
[""]
[""]
[""]
[""]
[""]
[""]
[""]
[""]
[""]
[""]
[""]
[""]
[""]
[""]
[""]
[""]
[""]
[""]
[""]
[""]
[""]
[""]
[""]
[""]
[""]
[""]
[""]
[""]
[""]
[""]
[""]
[""]
[""]
[""]
[""]
[{"$f":"CONCATENATE(B522,K522)","v":""}]
[""]
[""]
[""]
[""]
[""]
[""]
[""]
[""]
[""]
[""]
[""]
[""]
[""]
[""]
[""]
[""]
[""]
[""]
[""]
[""]
[""]
[""]
[""]
[""]
[""]
[""]
[""]
[""]
[""]
[""]
[""]
[""]
[""]
[""]
[""]
[""]
[""]
[""]
[""]
[""]
[""]
[""]
[""]
[""]
[""]
[""]
[""]
[""]
[""]
[""]
[""]
[""]
[""]
[""]
[""]
[""]
[""]
[""]
[""]
[""]
[""]
[""]
[""]
[{"$f":"CONCATENATE(B586,K586)","v":""}]
[""]
[""]
[""]
[""]
[""]
[""]
[""]
[""]
[""]
[""]
[""]
[""]
[""]
[""]
[""]
[""]
[""]
[""]
[""]
[""]
[""]
[""]
[""]
[""]
[""]
[""]
[""]
[""]
[""]
[""]
[""]
[""]
[""]
[""]
[""]
[""]
[""]
[""]
[""]
[""]
[""]
[""]
[""]
[""]
[""]
[""]
[""]
[""]
[""]
[""]
[""]
[""]
[""]
[""]
[""]
[""]
[""]
[""]
[""]
[""]
[""]
[""]
[""]
[{"$f":"CONCATENATE(B650,K650)","v":""}]
[""]
[""]
[""]
[""]
[""]
[""]
[""]
[""]
[""]
[""]
[""]
[""]
[""]
[""]
[""]
[""]
[""]
[""]
[""]
[""]
[""]
[""]
[""]
[""]
[""]
[""]
[""]
[""]
[""]
[""]
[""]
[""]
[""]
[""]
[""]
[""]
[""]
[""]
[""]
[""]
[""]
[""]
[""]
[""]
[""]
[""]
[""]
[""]
[""]
[""]
[""]
[""]
[""]
[""]
[""]
[""]
[""]
[""]
[""]
[""]
[""]
[""]
[""]
[{"$f":"CONCATENATE(B714,K714)","v":""}]
[""]
[""]
[""]
[""]
[""]
[""]
[""]
[""]
[""]
[""]
[""]
[""]
[""]
[""]
[""]
[""]
[""]
[""]
[""]
[""]
[""]
[""]
[""]
[""]
[""]
[""]
[""]
[""]
[""]
[""]
[""]
[""]
[""]
[""]
[""]
[""]
[""]
[""]
[""]
[""]
[""]
[""]
[""]
[""]
[""]
[""]
[""]
[""]
[""]
[""]
[""]
[""]
[""]
[""]
[""]
[""]
[""]
[""]
[""]
[""]
[""]
[""]
[""]
[{"$f":"CONCATENATE(B778,K778)","v":""}]
[""]
[""]
[""]
[""]
[""]
[""]
[""]
[""]
[""]
[""]
[""]
[""]
[""]
[""]
[""]
[""]
[""]
[""]
[""]
[""]
[""]
[""]
[""]
[""]
[""]
[""]
[""]
[""]
[""]
[""]
[""]
[""]
[""]
[""]
[""]
[""]
[""]
[""]
[""]
[""]
[""]
[""]
[""]
[""]
[""]
[""]
[""]
[""]
[""]
[""]
[""]
[""]
[""]
[""]
[""]
[""]
[""]
[""]
[""]
[""]
[""]
[""]
[""]
[{"$f":"CONCATENATE(B842,K842)","v":""}]
[""]
[""]
[""]
[""]
[""]
[""]
[""]
[""]
[""]
[""]
[""]
[""]
[""]
[""]
[""]
[""]
[""]
[""]
[""]
[""]
[""]
[""]
[""]
[""]
[""]
[""]
[""]
[""]
[""]
[""]
[""]
[""]
[""]
[""]
[""]
[""]
[""]
[""]
[""]
[""]
[""]
[""]
[""]
[""]
[""]
[""]
[""]
[""]
[""]
[""]
[""]
[""]
[""]
[""]
[""]
[""]
[""]
[""]
[""]
[""]
[""]
[""]
[""]
[{"$f":"CONCATENATE(B906,K906)","v":""}]
[""]
[""]
[""]
[""]
[""]
[""]
[""]
[""]
[""]
[""]
[""]
[""]
[""]
[""]
[""]
[""]
[""]
[""]
[""]
[""]
[""]
[""]
[""]
[""]
[""]
[""]
[""]
[""]
[""]
[""]
[""]
[""]
[""]
[""]
[""]
[""]
[""]
[""]
[""]
[""]
[""]
[""]
[""]
[""]
[""]
[""]
[""]
[""]
[""]
[""]
[""]
[""]
[""]
[""]
[""]
[""]
[""]
[""]
[""]
[""]
[""]
[""]
[""]
[{"$f":"CONCATENATE(B970,K970)","v":""}]
[""]
[""]
[""]
[""]
[""]
[""]
[""]
[""]
[""]
[""]
[""]
[""]
[""]
[""]
[""]
[""]
[""]
[""]
[""]
[""]
[""]
[""]
[""]
[""]
[""]
[""]
[""]
[""]
[""]
[""]
[""]
[""]
[""]
[""]
[""]
[""]
[""]
[""]
[""]
[""]
[""]
[""]
[""]
[""]
[""]
[""]
[""]
[""]
[""]
[""]
[""]
[""]
[""]
[""]
[""]
[""]
[""]
[""]
[""]
[""]
[""]
[""]
[""]
[{"$f":"CONCATENATE(B1034,K1034)","v":""}]
[""]
[""]
[""]
[""]
[""]
[""]
[""]
[""]
[""]
[""]
[""]
[""]
[""]
[""]
[""]
[""]
[""]
[""]
[""]
[""]
[""]
[""]
[""]
[""]
[""]
[""]
[""]
[""]
[""]
[""]
[""]
[""]
[""]
[""]
[""]
[""]
[""]
[""]
[""]
[""]
[""]
[""]
[""]
[""]
[""]
[""]
[""]
[""]
[""]
[""]
[""]
[""]
[""]
[""]
[""]
[""]
[""]
[""]
[""]
[""]
[""]
[""]
[""]
[{"$f":"CONCATENATE(B1098,K1098)","v":""}]
[""]
[""]
[""]
[""]
[""]
[""]
[""]
[""]
[""]
[""]
[""]
[""]
[""]
[""]
[""]
[""]
[""]
[""]
[""]
[""]
[""]
[""]
[""]
[""]
[""]
[""]
[""]
[""]
[""]
[""]
[""]
[""]
[""]
[""]
[""]
[""]
[""]
[""]
[""]
[""]
[""]
[""]
[""]
[""]
[""]
[""]
[""]
[""]
[""]
[""]
[""]
[""]
[""]
[""]
[""]
[""]
[""]
[""]
[""]
[""]
[""]
[""]
[""]
[{"$f":"CONCATENATE(B1162,K1162)","v":""}]
[""]
[""]
[""]
[""]
[""]
[""]
[""]
[""]
[""]
[""]
[""]
[""]
[""]
[""]
[""]
[""]
[""]
[""]
[""]
[""]
[""]
[""]
[""]
[""]
[""]
[""]
[""]
[""]
[""]
[""]
[""]
[""]
[""]
[""]
[""]
[""]
[""]
[""]
[""]
[""]
[""]
[""]
[""]
[""]
[""]
[""]
[""]
[""]
[""]
[""]
[""]
[""]
[""]
[""]
[""]
[""]
[""]
[""]
[""]
[""]
[""]
[""]
[""]
[{"$f":"CONCATENATE(B1226,K1226)","v":""}]
[""]
[""]
[""]
[""]
[""]
[""]
[""]
[""]
[""]
[""]
[""]
[""]
[""]
[""]
[""]
[""]
[""]
[""]
[""]
[""]
[""]
[""]
[""]
[""]
[""]
[""]
[""]
[""]
[""]
[""]
[""]
[""]
[""]
[""]
[""]
[""]
[""]
[""]
[""]
[""]
[""]
[""]
[""]
[""]
[""]
[""]
[""]
[""]
[""]
[""]
[""]
[""]
[""]
[""]
[""]
[""]
[""]
[""]
[""]
[""]
[""]
[""]
[""]
[{"$f":"CONCATENATE(B1290,K1290)","v":""}]
[""]
[""]
[""]
[""]
[""]
[""]
[""]
[""]
[""]
[""]
[""]
[""]
[""]
[""]
[""]
[""]
[""]
[""]
[""]
[""]
[""]
[""]
[""]
[""]
[""]
[""]
[""]
[""]
[""]
[""]
[""]
[""]
[""]
[""]
[""]
[""]
[""]
[""]
[""]
[""]
[""]
[""]
[""]
[""]
[""]
[""]
[""]
[""]
[""]
[""]
[""]
[""]
[""]
[""]
[""]
[""]
[""]
[""]
[""]
[""]
[""]
[""]
[""]
[{"$f":"CONCATENATE(B1354,K1354)","v":""}]
[""]
[""]
[""]
[""]
[""]
[""]
[""]
[""]
[""]
[""]
[""]
[""]
[""]
[""]
[""]
[""]
[""]
[""]
[""]
[""]
[""]
[""]
[""]
[""]
[""]
[""]
[""]
[""]
[""]
[""]
[""]
[""]
[""]
[""]
[""]
[""]
[""]
[""]
[""]
[""]
[""]
[""]
[""]
[""]
[""]
[""]
[""]
[""]
[""]
[""]
[""]
[""]
[""]
[""]
[""]
[""]
[""]
[""]
[""]
[""]
[""]
[""]
[""]
[{"$f":"CONCATENATE(B1418,K1418)","v":""}]
[""]
[""]
[""]
[""]
[""]
[""]
[""]
[""]
[""]
[""]
[""]
[""]
[""]
[""]
[""]
[""]
[""]
[""]
[""]
[""]
[""]
[""]
[""]
[""]
[""]
[""]
[""]
[""]
[""]
[""]
[""]
[""]
[""]
[""]
[""]
[""]
[""]
[""]
[""]
[""]
[""]
[""]
[""]
[""]
[""]
[""]
[""]
[""]
[""]
[""]
[""]
[""]
[""]
[""]
[""]
[""]
[""]
[""]
[""]
[""]
[""]
[""]
[""]
[{"$f":"CONCATENATE(B1482,K1482)","v":""}]
[""]
[""]
[""]
[""]
[""]
[""]
[""]
[""]
[""]
[""]
[""]
[""]
[""]
[""]
[""]
[""]
[""]
[""]
[""]
[""]
[""]
[""]
[""]
[""]
[""]
[""]
[""]
[""]
[""]
[""]
[""]
[""]
[""]
[""]
[""]
[""]
[""]
[""]
[""]
[""]
[""]
[""]
[""]
[""]
[""]
[""]
[""]
[""]
[""]
[""]
[""]
[""]
[""]
[""]
[""]
[""]
[""]
[""]
[""]
[""]
[""]
[""]
[""]
[{"$f":"CONCATENATE(B1546,K1546)","v":""}]
[""]
[""]
[""]
[""]
[""]
[""]
[""]
[""]
[""]
[""]
[""]
[""]
[""]
[""]
[""]
[""]
[""]
[""]
[""]
[""]
[""]
[""]
[""]
[""]
[""]
[""]
[""]
[""]
[""]
[""]
[""]
[""]
[""]
[""]
[""]
[""]
[""]
[""]
[""]
[""]
[""]
[""]
[""]
[""]
[""]
[""]
[""]
[""]
[""]
[""]
[""]
[""]
[""]
[""]
[""]
[""]
[""]
[""]
[""]
[""]
[""]
[""]
[""]
[{"$f":"CONCATENATE(B1610,K1610)","v":""}]
[""]
[""]
[""]
[""]
[""]
[""]
[""]
[""]
[""]
[""]
[""]
[""]
[""]
[""]
[""]
[""]
[""]
[""]
[""]
[""]
[""]
[""]
[""]
[""]
[""]
[""]
[""]
[""]
[""]
[""]
[""]
[""]
[""]
[""]
[""]
[""]
[""]
[""]
[""]
[""]
[""]
[""]
[""]
[""]
[""]
[""]
[""]
[""]
[""]
[""]
[""]
[""]
[""]
[""]
[""]
[""]
[""]
[""]
[""]
[""]
[""]
[""]
[""]
[{"$f":"CONCATENATE(B1674,K1674)","v":""}]
[""]
[""]
[""]
[""]
[""]
[""]
[""]
[""]
[""]
[""]
[""]
[""]
[""]
[""]
[""]
[""]
[""]
[""]
[""]
[""]
[""]
[""]
[""]
[""]
[""]
[""]
[""]
[""]
[""]
[""]
[""]
[""]
[""]
[""]
[""]
[""]
[""]
[""]
[""]
[""]
[""]
[""]
[""]
[""]
[""]
[""]
[""]
[""]
[""]
[""]
[""]
[""]
[""]
[""]
[""]
[""]
[""]
[""]
[""]
[""]
[""]
[""]
[""]
[{"$f":"CONCATENATE(B1738,K1738)","v":""}]
[""]
[""]
[""]
[""]
[""]
[""]
[""]
[""]
[""]
[""]
[""]
[""]
[""]
[""]
[""]
[""]
[""]
[""]
[""]
[""]
[""]
[""]
[""]
[""]
[""]
[""]
[""]
[""]
[""]
[""]
[""]
[""]
[""]
[""]
[""]
[""]
[""]
[""]
[""]
[""]
[""]
[""]
[""]
[""]
[""]
[""]
[""]
[""]
[""]
[""]
[""]
[""]
[""]
[""]
[""]
[""]
[""]
[""]
[""]
[""]
[""]
[""]
[""]
[{"$f":"CONCATENATE(B1802,K1802)","v":""}]
[""]
[""]
[""]
[""]
[""]
[""]
[""]
[""]
[""]
[""]
[""]
[""]
[""]
[""]
[""]
[""]
[""]
[""]
[""]
[""]
[""]
[""]
[""]
[""]
[""]
[""]
[""]
[""]
[""]
[""]
[""]
[""]
[""]
[""]
[""]
[""]
[""]
[""]
[""]
[""]
[""]
[""]
[""]
[""]
[""]
[""]
[""]
[""]
[""]
[""]
[""]
[""]
[""]
[""]
[""]
[""]
[""]
[""]
[""]
[""]
[""]
[""]
[""]
[{"$f":"CONCATENATE(B1866,K1866)","v":""}]
[""]
[""]
[""]
[""]
[""]
[""]
[""]
[""]
[""]
[""]
[""]
[""]
[""]
[""]
[""]
[""]
[""]
[""]
[""]
[""]
[""]
[""]
[""]
[""]
[""]
[""]
[""]
[""]
[""]
[""]
[""]
[""]
[""]
[""]
[""]
[""]
[""]
[""]
[""]
[""]
[""]
[""]
[""]
[""]
[""]
[""]
[""]
[""]
[""]
[""]
[""]
[""]
[""]
[""]
[""]
[""]
[""]
[""]
[""]
[""]
[""]
[""]
[""]
[{"$f":"CONCATENATE(B1930,K1930)","v":""}]
[""]
[""]
[""]
[""]
[""]
[""]
[""]
[""]
[""]
[""]
[""]
[""]
[""]
[""]
[""]
[""]
[""]
[""]
[""]
[""]
[""]
[""]
[""]
[""]
[""]
[""]
[""]
[""]
[""]
[""]
[""]
[""]
[""]
[""]
[""]
[""]
[""]
[""]
[""]
[""]
[""]
[""]
[""]
[""]
[""]
[""]
[""]
[""]
[""]
[""]
[""]
[""]
[""]
[""]
[""]
[""]
[""]
[""]
[""]
[""]
[""]
[""]
[""]
[{"$f":"CONCATENATE(B1994,K1994)","v":""}]
[""]
[""]
[""]
[""]
[""]
[""]
[""]

{"sheet":"GW PAHs & Metals","index":9,"n_rows":80,"n_cols":31,"rows_kept":80,"cut":false,"hidden":false,"merged":[[0,0,0,28],[1,1,1,28],[2,0,3,0],[2,1,3,1],[2,2,3,2],[2,4,3,4],[2,5,2,18],[2,19,2,28],[2,3,3,3]]}
["Groundwater PAH Data Table",null,null,null,null,null,null,null,null,null,null,null,null,null,null,null,null,null,null,null,null,null,null,null,null,null,null,null,null,null,"Insert rows between the last line of data and the last line of the table. Highlight the number of rows needed, right-click, go to insert."]
["Notes: ","If a result is less than the detection limit, input \"<\" followed by the detection limit. If a compound is not analyzed, input \"NA\"",null,null,null,null,null,null,null,null,null,null,null,null,null,null,null,null,null,null,null,null,null,null,null,null,null,null,null,null,"DO NOT ctrl-V when pasting data into the table, right-click and PASTE VALUES"]
["Well ID","Sample Type","Sample Depth","Depth to Water\n(ft bmp)","Sample Date","ANALYTICAL METHOD (UNITS)",null,null,null,null,null,null,null,null,null,null,null,null,null,"ANALYTICAL METHOD (UNITS)"]
[null,null,null,null,null,"Anthracene","Acenaphthene","Benz(a)anthracene","Benzo(a)pyrene","Benzo(b)fluoranthene","Benzo(k)fluoranthene","Chrysene","Dibenz[ah]anthracene","Fluoranthene","Fluorene","Indeno [1,2,3-cd] pyrene","Napthalene","Pyrene","Tetraethyl Lead (TEL)","Arsenic","Barium","Cadmium","Chromium III","Chromium VI","Chromium (Total)","Lead","Selenium","Silver","Mercury"]
["CAS Numbers",null,null,null,null,"120-12-7","83-32-9","56-55-3","50-32-8","205-99-2","207-08-9","218-01-9","53-70-3","206-44-0","86-73-7","193-39-5","91-20-3","129-00-0","78-00-2","7440-38-2","7440-39-3","7440-43-9","16065-83-1","18540-29-9","7440-47-3","7439-92-1","7782-49-2","7440-22-4","7487-94-7"]
["ADEQ Release Confirmation Levels (RCLs) (µg/L)",null,null,null,null,0.05,1,0.2,0.05,0.1,0.05,0.1,0.1,0.1,0.1,0.1,0.5,0.1,"NE","NE","NE","NE","NE","NE","NE","NE","NE","NE","NE"]
["Aquifer Water Quality Standards (µg/L)",null,null,null,null,"NE","NE","NE",0.2,"NE","NE","NE","NE","NE","NE","NE","NE","NE","NE",50,2000,5,100,100,100,50,50,"NE",2]
[]
[]
[]
[]
[]
[]
[]
[]
[]
[]
[]
[]
[]
[]
[]
[]
[]
[]
[]
[]
[]
[]
[]
[]
[]
[]
[]
[]
[]
[]
[]
[]
[]
[]
[null,null,null,null,null,null,null,null,null,null,null,null,null,null,null,null,null,null,null,null,null,null,null,null,null,null,null,null,null,null,"END OF FIRST PAGE BREAK"]
[]
[]
[]
[]
[]
[]
[]
[]
[]
[]
[]
[]
[]
[]
[]
[]
[]
[]
[]
[]
[]
[]
[]
[]
[]
[]
[]
[]
[]
[]
[]
[]
[]
[]
[null,null,null,null,null,null,null,null,null,null,null,null,null,null,null,null,null,null,null,null,null,null,null,null,null,null,null,null,null,null,"END OF SECOND PAGE BREAK"]
[]
["Insert rows between the last line of data and the last line of the table. Highlight the number of rows needed, right-click, go to insert."]
["DO NOT ctrl-V when pasting data into the table, right-click and PASTE VALUES"]

{"sheet":"Site Well,Boring Construction","index":10,"n_rows":36,"n_cols":88,"rows_kept":36,"cut":false,"hidden":false,"merged":[[1,61,1,62],[1,2,2,2],[1,5,2,5],[1,10,2,10],[0,0,0,11],[1,0,2,0],[1,1,2,1],[1,3,2,3],[1,4,2,4],[1,6,2,6],[1,7,2,7],[1,8,2,8],[1,9,2,9],[1,11,2,11]]}
["Well Construction Table",null,null,null,null,null,null,null,null,null,null,null,null,"Insert rows between the last line of data and the last line of the table. Highlight the number of rows needed, right-click, go to insert."]
["ADWR Number","Well ID","Date Surveyed","Latitude (formatted as +/- DDMMSS.SSSS)","Longitude (formatted as +/- DDDMMSS.SSSS)","Measuring Point Elevation\n(feet amsl)","Well Status (if not sampled)","Well Diameter (inches)","Top Of Screen\n(ft bgs)","Bottom Of Screen\n(ft bgs)","Well Depth (ft bgs)","Boring Depth (ft bgs)",null,"DO NOT ctrl-V when pasting data into the table, right-click and PASTE VALUES",null,null,null,null,null,null,null,null,null,null,null,null,null,null,null,null,null,null,null,null,null,null,null,null,null,null,null,null,null,null,null,null,null,null,null,null,null,null,null,null,null,null,null,null,null,null,null,"Tier 1 Standard (µg/L)",null,5,"NE","NE","NE","NE","NE","NE",0.05,5,"NE",700,"NE","NE","NE","NE","NE","20 or 94*","NE","NE","NE",1000,10000,"NE","NE","NE"]
[]
[null,null,null,null,null,null,null,null,null,null,null,null,null,"Date:","Specify Coordinate System Used:"]
[null,null,null,null,null,null,null,null,null,null,null,null,null,null,"Lateral:"]
[null,null,null,null,null,null,null,null,null,null,null,null,null,null,"Vertical:"]
[]
[null,null,null,null,null,null,null,null,null,null,null,null,null,"Date:","Specify Coordinate System Used:"]
[null,null,null,null,null,null,null,null,null,null,null,null,null,null,"Lateral:"]
[null,null,null,null,null,null,null,null,null,null,null,null,null,null,"Vertical:"]
[]
[null,null,null,null,null,null,null,null,null,null,null,null,null,"Date:","Specify Coordinate System Used:"]
[null,null,null,null,null,null,null,null,null,null,null,null,null,null,"Lateral:"]
[null,null,null,null,null,null,null,null,null,null,null,null,null,null,"Vertical:"]
[]
[]
[]
[]
[]
[]
[]
[]
[]
[]
[]
[]
[]
[]
[]
[]
[]
[]
[]
[]
["Insert rows between the last line of data and the last line of the table. Highlight the number of rows needed, right-click, go to insert."]
["DO NOT ctrl-V when pasting data into the table, right-click and PASTE VALUES"]

{"sheet":"GW Parameter Table","index":11,"n_rows":67,"n_cols":16,"rows_kept":67,"cut":false,"hidden":false,"merged":[[2,1,3,1],[2,0,3,0],[0,0,0,13]]}
["Groundwater Parameter Table"]
["Notes: ","If a result is less than the detection limit, input \"<\" followed by the detection limit."]
["Well ID","Sample Date","Temp","pH","Specific Conductance","Oxidation Reduction Potential (ORP)","Dissolved Oxygen (DO)","Nitrate (NO3-)","Manganese (Mn+2)","Ferrous Iron (Fe+2)","Sulfate (SO4-2)","Alkalinity","Carbon Dioxide (CO2)","Methane (CH4)"]
[null,null,"°C","unitless","µS/cm","mV","mg/L","mg/L","mg/L","mg/L","mg/L","mg/L","mg/L","mg/L",null,"Insert rows between the last line of data and the last line of the table. Highlight the number of rows needed, right-click, go to insert."]
[null,null,null,null,null,null,null,null,null,null,null,null,null,null,null,"DO NOT ctrl-V when pasting data into the table, right-click and PASTE VALUES"]
[]
[]
[]
[]
[]
[]
[]
[]
[]
[]
[]
[]
[]
[]
[]
[]
[]
[]
[]
[]
[]
[]
[]
[]
[]
[]
[]
[]
[]
[]
[]
[]
[]
[]
[]
[]
[]
[]
[]
[]
[]
[]
[]
[]
[]
[]
[]
[]
[]
[]
[]
[]
[]
[]
[]
[]
[]
[]
[]
[]
["Insert rows between the last line of data and the last line of the table. Highlight the number of rows needed, right-click, go to insert."]
["DO NOT ctrl-V when pasting data into the table, right-click and PASTE VALUES"]

{"sheet":"Prototype Tab","index":12,"n_rows":31,"n_cols":54,"rows_kept":31,"cut":false,"hidden":true,"merged":[[0,11,0,15],[1,0,1,3],[1,4,1,21],[2,0,4,1],[2,2,4,3],[2,4,4,4],[0,0,0,9],[5,0,6,0],[7,0,8,0],[9,0,10,0],[2,5,4,5],[23,0,24,0],[11,0,12,0],[13,0,14,0],[15,0,16,0],[17,0,18,0],[19,0,20,0],[21,0,22,0]]}
["Groundwater Trends and Remediation Timeline Table",null,null,null,null,null,null,null,null,null,null,"DO NOT PRINT THIS TAB"]
["Corrective Action Summary",null,null,null,"Corrective Action Summary",null,null,null,null,null,null,null,null,null,null,null,null,null,null,null,null,null,null,null,null,null,null,null,null,null,null,null,null,null,null,null,null,null,null,null,null,null,null,null,null,null,null,null,null,null,null,null,"Benzene",9]
["Activity Type",null,"Date",null,"Well ID(s) ","Date",{"$f":"E6","v":"BOC-01"},{"$f":"E7","v":"BOC-02"},{"$f":"E8","v":"BOC-03"},{"$f":"E9","v":"BOC-07"},{"$f":"E10","v":"BOC-09"},{"$f":"E11","v":"BOC-10"},{"$f":"E12","v":"BOC-11"},{"$f":"E13","v":"BOC-12"},{"$f":"E14","v":"BOC-13"},{"$f":"E15","v":"BOC-14"},{"$f":"E16","v":"DP-02"},{"$f":"E17","v":"DP-03"},{"$f":"E18","v":"DP-04"},{"$f":"E19","v":"MW-06"},{"$f":"E20","v":"MW-15"},{"$f":"E21","v":"MW-16"},null,null,null,null,null,null,null,null,null,null,null,null,null,null,null,null,null,null,null,null,null,null,null,null,null,null,null,null,null,null,"Toluene",67]
[null,null,null,null,null,null,{"$f":"VLOOKUP(G5,$BA$2:$BB$6,2,FALSE)","v":9},{"$f":"G4","v":9},{"$f":"H4","v":9},9,9,9,9,9,9,9,9,{"$f":"Q4","v":9},9,9,9,9,null,null,null,null,null,null,null,null,null,null,null,null,null,null,null,null,null,null,null,null,null,null,null,null,null,null,null,null,null,null,"Ethylbenzene",48]
[null,null,null,null,null,null,"Benzene",{"$f":"G5","v":"Benzene"},"Benzene","Benzene","Benzene","Benzene","Benzene","Benzene","Benzene","Benzene","Benzene","Benzene","Benzene","Benzene","Benzene","Benzene",null,null,null,null,null,null,null,null,null,null,null,null,null,null,null,null,null,null,null,null,null,null,null,null,null,null,null,null,null,null,"Total Xylenes",79]
["Continuous System 1",10,"2000-01-01","Start","BOC-01","1987-06-02",{"$f":"IF(VLOOKUP($E$6&$F6,'GW VOCs Table'!$A$9:$CG$5001,G$4,FALSE)>0,VLOOKUP($E$6&$F6,'GW VOCs Table'!$A$9:$CG$5001,G$4,FALSE),#N/A)","v":{"$error":"#N/A"}},{"$f":"IF(VLOOKUP($E$7&$F6,'GW VOCs Table'!$A$9:$CG$5001,H$4,FALSE)>0,VLOOKUP($E$7&$F6,'GW VOCs Table'!$A$9:$CG$5001,H$4,FALSE),#N/A)","v":{"$error":"#N/A"}},{"$f":"IF(VLOOKUP($E$8&$F6,'GW VOCs Table'!$A$9:$CG$5001,I$4,FALSE)>0,VLOOKUP($E$8&$F6,'GW VOCs Table'!$A$9:$CG$5001,I$4,FALSE),#N/A)","v":{"$error":"#N/A"}},{"$f":"IF(VLOOKUP($E$9&$F6,'GW VOCs Table'!$A$9:$CG$5001,J$4,FALSE)>0,VLOOKUP($E$9&$F6,'GW VOCs Table'!$A$9:$CG$5001,J$4,FALSE),#N/A)","v":{"$error":"#N/A"}},{"$f":"IF(VLOOKUP($E$10&$F6,'GW VOCs Table'!$A$9:$CG$5001,K$4,FALSE)>0,VLOOKUP($E$10&$F6,'GW VOCs Table'!$A$9:$CG$5001,K$4,FALSE),#N/A)","v":{"$error":"#N/A"}},{"$f":"IF(VLOOKUP($E$11&$F6,'GW VOCs Table'!$A$9:$CG$5001,L$4,FALSE)>0,VLOOKUP($E$11&$F6,'GW VOCs Table'!$A$9:$CG$5001,L$4,FALSE),#N/A)","v":{"$error":"#N/A"}},{"$f":"IF(VLOOKUP($E$12&$F6,'GW VOCs Table'!$A$9:$CG$5001,M$4,FALSE)>0,VLOOKUP($E$12&$F6,'GW VOCs Table'!$A$9:$CG$5001,M$4,FALSE),#N/A)","v":{"$error":"#N/A"}},{"$f":"IF(VLOOKUP($E$13&$F6,'GW VOCs Table'!$A$9:$CG$5001,N$4,FALSE)>0,VLOOKUP($E$13&$F6,'GW VOCs Table'!$A$9:$CG$5001,N$4,FALSE),#N/A)","v":{"$error":"#N/A"}},{"$f":"IF(VLOOKUP($E$14&$F6,'GW VOCs Table'!$A$9:$CG$5001,O$4,FALSE)>0,VLOOKUP($E$14&$F6,'GW VOCs Table'!$A$9:$CG$5001,O$4,FALSE),#N/A)","v":{"$error":"#N/A"}},{"$f":"IF(VLOOKUP($E$15&$F6,'GW VOCs Table'!$A$9:$CG$5001,P$4,FALSE)>0,VLOOKUP($E$15&$F6,'GW VOCs Table'!$A$9:$CG$5001,P$4,FALSE),#N/A)","v":{"$error":"#N/A"}},{"$f":"IF(VLOOKUP($E$16&$F6,'GW VOCs Table'!$A$9:$CG$5001,Q$4,FALSE)>0,VLOOKUP($E$16&$F6,'GW VOCs Table'!$A$9:$CG$5001,Q$4,FALSE),#N/A)","v":{"$error":"#N/A"}},{"$f":"IF(VLOOKUP($E$17&$F6,'GW VOCs Table'!$A$9:$CG$5001,R$4,FALSE)>0,VLOOKUP($E$17&$F6,'GW VOCs Table'!$A$9:$CG$5001,R$4,FALSE),#N/A)","v":{"$error":"#N/A"}},{"$f":"IF(VLOOKUP($E$18&$F6,'GW VOCs Table'!$A$9:$CG$5001,S$4,FALSE)>0,VLOOKUP($E$18&$F6,'GW VOCs Table'!$A$9:$CG$5001,S$4,FALSE),#N/A)","v":{"$error":"#N/A"}},{"$f":"IF(VLOOKUP($E$19&$F6,'GW VOCs Table'!$A$9:$CG$5001,T$4,FALSE)>0,VLOOKUP($E$19&$F6,'GW VOCs Table'!$A$9:$CG$5001,T$4,FALSE),#N/A)","v":{"$error":"#N/A"}},{"$f":"IF(VLOOKUP($E$20&$F6,'GW VOCs Table'!$A$9:$CG$5001,U$4,FALSE)>0,VLOOKUP($E$20&$F6,'GW VOCs Table'!$A$9:$CG$5001,U$4,FALSE),#N/A)","v":{"$error":"#N/A"}},{"$f":"IF(VLOOKUP($E$21&$F6,'GW VOCs Table'!$A$9:$CG$5001,V$4,FALSE)>0,VLOOKUP($E$21&$F6,'GW VOCs Table'!$A$9:$CG$5001,V$4,FALSE),#N/A)","v":{"$error":"#N/A"}},null,null,null,null,null,null,null,null,null,null,null,null,null,null,null,null,null,null,null,null,null,null,null,null,null,null,null,null,null,null,"MTBE",58]
[null,10,"2004-01-01","End","BOC-02","1989-08-09",{"$f":"IF(VLOOKUP($E$6&$F7,'GW VOCs Table'!$A$9:$CG$5001,G$4,FALSE)>0,VLOOKUP($E$6&$F7,'GW VOCs Table'!$A$9:$CG$5001,G$4,FALSE),#N/A)","v":{"$error":"#N/A"}},{"$f":"IF(VLOOKUP($E$7&$F7,'GW VOCs Table'!$A$9:$CG$5001,H$4,FALSE)>0,VLOOKUP($E$7&$F7,'GW VOCs Table'!$A$9:$CG$5001,H$4,FALSE),#N/A)","v":{"$error":"#N/A"}},{"$f":"IF(VLOOKUP($E$8&$F7,'GW VOCs Table'!$A$9:$CG$5001,I$4,FALSE)>0,VLOOKUP($E$8&$F7,'GW VOCs Table'!$A$9:$CG$5001,I$4,FALSE),#N/A)","v":{"$error":"#N/A"}},{"$f":"IF(VLOOKUP($E$9&$F7,'GW VOCs Table'!$A$9:$CG$5001,J$4,FALSE)>0,VLOOKUP($E$9&$F7,'GW VOCs Table'!$A$9:$CG$5001,J$4,FALSE),#N/A)","v":{"$error":"#N/A"}},{"$f":"IF(VLOOKUP($E$10&$F7,'GW VOCs Table'!$A$9:$CG$5001,K$4,FALSE)>0,VLOOKUP($E$10&$F7,'GW VOCs Table'!$A$9:$CG$5001,K$4,FALSE),#N/A)","v":{"$error":"#N/A"}},{"$f":"IF(VLOOKUP($E$11&$F7,'GW VOCs Table'!$A$9:$CG$5001,L$4,FALSE)>0,VLOOKUP($E$11&$F7,'GW VOCs Table'!$A$9:$CG$5001,L$4,FALSE),#N/A)","v":{"$error":"#N/A"}},{"$f":"IF(VLOOKUP($E$12&$F7,'GW VOCs Table'!$A$9:$CG$5001,M$4,FALSE)>0,VLOOKUP($E$12&$F7,'GW VOCs Table'!$A$9:$CG$5001,M$4,FALSE),#N/A)","v":{"$error":"#N/A"}},{"$f":"IF(VLOOKUP($E$13&$F7,'GW VOCs Table'!$A$9:$CG$5001,N$4,FALSE)>0,VLOOKUP($E$13&$F7,'GW VOCs Table'!$A$9:$CG$5001,N$4,FALSE),#N/A)","v":{"$error":"#N/A"}},{"$f":"IF(VLOOKUP($E$14&$F7,'GW VOCs Table'!$A$9:$CG$5001,O$4,FALSE)>0,VLOOKUP($E$14&$F7,'GW VOCs Table'!$A$9:$CG$5001,O$4,FALSE),#N/A)","v":{"$error":"#N/A"}},{"$f":"IF(VLOOKUP($E$15&$F7,'GW VOCs Table'!$A$9:$CG$5001,P$4,FALSE)>0,VLOOKUP($E$15&$F7,'GW VOCs Table'!$A$9:$CG$5001,P$4,FALSE),#N/A)","v":{"$error":"#N/A"}},{"$f":"IF(VLOOKUP($E$16&$F7,'GW VOCs Table'!$A$9:$CG$5001,Q$4,FALSE)>0,VLOOKUP($E$16&$F7,'GW VOCs Table'!$A$9:$CG$5001,Q$4,FALSE),#N/A)","v":{"$error":"#N/A"}},{"$f":"IF(VLOOKUP($E$17&$F7,'GW VOCs Table'!$A$9:$CG$5001,R$4,FALSE)>0,VLOOKUP($E$17&$F7,'GW VOCs Table'!$A$9:$CG$5001,R$4,FALSE),#N/A)","v":{"$error":"#N/A"}},{"$f":"IF(VLOOKUP($E$18&$F7,'GW VOCs Table'!$A$9:$CG$5001,S$4,FALSE)>0,VLOOKUP($E$18&$F7,'GW VOCs Table'!$A$9:$CG$5001,S$4,FALSE),#N/A)","v":{"$error":"#N/A"}},{"$f":"IF(VLOOKUP($E$19&$F7,'GW VOCs Table'!$A$9:$CG$5001,T$4,FALSE)>0,VLOOKUP($E$19&$F7,'GW VOCs Table'!$A$9:$CG$5001,T$4,FALSE),#N/A)","v":{"$error":"#N/A"}},{"$f":"IF(VLOOKUP($E$20&$F7,'GW VOCs Table'!$A$9:$CG$5001,U$4,FALSE)>0,VLOOKUP($E$20&$F7,'GW VOCs Table'!$A$9:$CG$5001,U$4,FALSE),#N/A)","v":{"$error":"#N/A"}},{"$f":"IF(VLOOKUP($E$21&$F7,'GW VOCs Table'!$A$9:$CG$5001,V$4,FALSE)>0,VLOOKUP($E$21&$F7,'GW VOCs Table'!$A$9:$CG$5001,V$4,FALSE),#N/A)","v":{"$error":"#N/A"}}]
["Continuous System 2",10,"2004-03-01","Start","BOC-03","1991-02-21",{"$f":"IF(VLOOKUP($E$6&$F8,'GW VOCs Table'!$A$9:$CG$5001,G$4,FALSE)>0,VLOOKUP($E$6&$F8,'GW VOCs Table'!$A$9:$CG$5001,G$4,FALSE),#N/A)","v":{"$error":"#N/A"}},{"$f":"IF(VLOOKUP($E$7&$F8,'GW VOCs Table'!$A$9:$CG$5001,H$4,FALSE)>0,VLOOKUP($E$7&$F8,'GW VOCs Table'!$A$9:$CG$5001,H$4,FALSE),#N/A)","v":{"$error":"#N/A"}},{"$f":"IF(VLOOKUP($E$8&$F8,'GW VOCs Table'!$A$9:$CG$5001,I$4,FALSE)>0,VLOOKUP($E$8&$F8,'GW VOCs Table'!$A$9:$CG$5001,I$4,FALSE),#N/A)","v":{"$error":"#N/A"}},{"$f":"IF(VLOOKUP($E$9&$F8,'GW VOCs Table'!$A$9:$CG$5001,J$4,FALSE)>0,VLOOKUP($E$9&$F8,'GW VOCs Table'!$A$9:$CG$5001,J$4,FALSE),#N/A)","v":{"$error":"#N/A"}},{"$f":"IF(VLOOKUP($E$10&$F8,'GW VOCs Table'!$A$9:$CG$5001,K$4,FALSE)>0,VLOOKUP($E$10&$F8,'GW VOCs Table'!$A$9:$CG$5001,K$4,FALSE),#N/A)","v":{"$error":"#N/A"}},{"$f":"IF(VLOOKUP($E$11&$F8,'GW VOCs Table'!$A$9:$CG$5001,L$4,FALSE)>0,VLOOKUP($E$11&$F8,'GW VOCs Table'!$A$9:$CG$5001,L$4,FALSE),#N/A)","v":{"$error":"#N/A"}},{"$f":"IF(VLOOKUP($E$12&$F8,'GW VOCs Table'!$A$9:$CG$5001,M$4,FALSE)>0,VLOOKUP($E$12&$F8,'GW VOCs Table'!$A$9:$CG$5001,M$4,FALSE),#N/A)","v":{"$error":"#N/A"}},{"$f":"IF(VLOOKUP($E$13&$F8,'GW VOCs Table'!$A$9:$CG$5001,N$4,FALSE)>0,VLOOKUP($E$13&$F8,'GW VOCs Table'!$A$9:$CG$5001,N$4,FALSE),#N/A)","v":{"$error":"#N/A"}},{"$f":"IF(VLOOKUP($E$14&$F8,'GW VOCs Table'!$A$9:$CG$5001,O$4,FALSE)>0,VLOOKUP($E$14&$F8,'GW VOCs Table'!$A$9:$CG$5001,O$4,FALSE),#N/A)","v":{"$error":"#N/A"}},{"$f":"IF(VLOOKUP($E$15&$F8,'GW VOCs Table'!$A$9:$CG$5001,P$4,FALSE)>0,VLOOKUP($E$15&$F8,'GW VOCs Table'!$A$9:$CG$5001,P$4,FALSE),#N/A)","v":{"$error":"#N/A"}},{"$f":"IF(VLOOKUP($E$16&$F8,'GW VOCs Table'!$A$9:$CG$5001,Q$4,FALSE)>0,VLOOKUP($E$16&$F8,'GW VOCs Table'!$A$9:$CG$5001,Q$4,FALSE),#N/A)","v":{"$error":"#N/A"}},{"$f":"IF(VLOOKUP($E$17&$F8,'GW VOCs Table'!$A$9:$CG$5001,R$4,FALSE)>0,VLOOKUP($E$17&$F8,'GW VOCs Table'!$A$9:$CG$5001,R$4,FALSE),#N/A)","v":{"$error":"#N/A"}},{"$f":"IF(VLOOKUP($E$18&$F8,'GW VOCs Table'!$A$9:$CG$5001,S$4,FALSE)>0,VLOOKUP($E$18&$F8,'GW VOCs Table'!$A$9:$CG$5001,S$4,FALSE),#N/A)","v":{"$error":"#N/A"}},{"$f":"IF(VLOOKUP($E$19&$F8,'GW VOCs Table'!$A$9:$CG$5001,T$4,FALSE)>0,VLOOKUP($E$19&$F8,'GW VOCs Table'!$A$9:$CG$5001,T$4,FALSE),#N/A)","v":{"$error":"#N/A"}},{"$f":"IF(VLOOKUP($E$20&$F8,'GW VOCs Table'!$A$9:$CG$5001,U$4,FALSE)>0,VLOOKUP($E$20&$F8,'GW VOCs Table'!$A$9:$CG$5001,U$4,FALSE),#N/A)","v":{"$error":"#N/A"}},{"$f":"IF(VLOOKUP($E$21&$F8,'GW VOCs Table'!$A$9:$CG$5001,V$4,FALSE)>0,VLOOKUP($E$21&$F8,'GW VOCs Table'!$A$9:$CG$5001,V$4,FALSE),#N/A)","v":{"$error":"#N/A"}}]
[null,10,"2008-01-01","End","BOC-07","1993-04-14",{"$f":"IF(VLOOKUP($E$6&$F9,'GW VOCs Table'!$A$9:$CG$5001,G$4,FALSE)>0,VLOOKUP($E$6&$F9,'GW VOCs Table'!$A$9:$CG$5001,G$4,FALSE),#N/A)","v":{"$error":"#N/A"}},{"$f":"IF(VLOOKUP($E$7&$F9,'GW VOCs Table'!$A$9:$CG$5001,H$4,FALSE)>0,VLOOKUP($E$7&$F9,'GW VOCs Table'!$A$9:$CG$5001,H$4,FALSE),#N/A)","v":{"$error":"#N/A"}},{"$f":"IF(VLOOKUP($E$8&$F9,'GW VOCs Table'!$A$9:$CG$5001,I$4,FALSE)>0,VLOOKUP($E$8&$F9,'GW VOCs Table'!$A$9:$CG$5001,I$4,FALSE),#N/A)","v":{"$error":"#N/A"}},{"$f":"IF(VLOOKUP($E$9&$F9,'GW VOCs Table'!$A$9:$CG$5001,J$4,FALSE)>0,VLOOKUP($E$9&$F9,'GW VOCs Table'!$A$9:$CG$5001,J$4,FALSE),#N/A)","v":{"$error":"#N/A"}},{"$f":"IF(VLOOKUP($E$10&$F9,'GW VOCs Table'!$A$9:$CG$5001,K$4,FALSE)>0,VLOOKUP($E$10&$F9,'GW VOCs Table'!$A$9:$CG$5001,K$4,FALSE),#N/A)","v":{"$error":"#N/A"}},{"$f":"IF(VLOOKUP($E$11&$F9,'GW VOCs Table'!$A$9:$CG$5001,L$4,FALSE)>0,VLOOKUP($E$11&$F9,'GW VOCs Table'!$A$9:$CG$5001,L$4,FALSE),#N/A)","v":{"$error":"#N/A"}},{"$f":"IF(VLOOKUP($E$12&$F9,'GW VOCs Table'!$A$9:$CG$5001,M$4,FALSE)>0,VLOOKUP($E$12&$F9,'GW VOCs Table'!$A$9:$CG$5001,M$4,FALSE),#N/A)","v":{"$error":"#N/A"}},{"$f":"IF(VLOOKUP($E$13&$F9,'GW VOCs Table'!$A$9:$CG$5001,N$4,FALSE)>0,VLOOKUP($E$13&$F9,'GW VOCs Table'!$A$9:$CG$5001,N$4,FALSE),#N/A)","v":{"$error":"#N/A"}},{"$f":"IF(VLOOKUP($E$14&$F9,'GW VOCs Table'!$A$9:$CG$5001,O$4,FALSE)>0,VLOOKUP($E$14&$F9,'GW VOCs Table'!$A$9:$CG$5001,O$4,FALSE),#N/A)","v":{"$error":"#N/A"}},{"$f":"IF(VLOOKUP($E$15&$F9,'GW VOCs Table'!$A$9:$CG$5001,P$4,FALSE)>0,VLOOKUP($E$15&$F9,'GW VOCs Table'!$A$9:$CG$5001,P$4,FALSE),#N/A)","v":{"$error":"#N/A"}},{"$f":"IF(VLOOKUP($E$16&$F9,'GW VOCs Table'!$A$9:$CG$5001,Q$4,FALSE)>0,VLOOKUP($E$16&$F9,'GW VOCs Table'!$A$9:$CG$5001,Q$4,FALSE),#N/A)","v":{"$error":"#N/A"}},{"$f":"IF(VLOOKUP($E$17&$F9,'GW VOCs Table'!$A$9:$CG$5001,R$4,FALSE)>0,VLOOKUP($E$17&$F9,'GW VOCs Table'!$A$9:$CG$5001,R$4,FALSE),#N/A)","v":{"$error":"#N/A"}},{"$f":"IF(VLOOKUP($E$18&$F9,'GW VOCs Table'!$A$9:$CG$5001,S$4,FALSE)>0,VLOOKUP($E$18&$F9,'GW VOCs Table'!$A$9:$CG$5001,S$4,FALSE),#N/A)","v":{"$error":"#N/A"}},{"$f":"IF(VLOOKUP($E$19&$F9,'GW VOCs Table'!$A$9:$CG$5001,T$4,FALSE)>0,VLOOKUP($E$19&$F9,'GW VOCs Table'!$A$9:$CG$5001,T$4,FALSE),#N/A)","v":{"$error":"#N/A"}},{"$f":"IF(VLOOKUP($E$20&$F9,'GW VOCs Table'!$A$9:$CG$5001,U$4,FALSE)>0,VLOOKUP($E$20&$F9,'GW VOCs Table'!$A$9:$CG$5001,U$4,FALSE),#N/A)","v":{"$error":"#N/A"}},{"$f":"IF(VLOOKUP($E$21&$F9,'GW VOCs Table'!$A$9:$CG$5001,V$4,FALSE)>0,VLOOKUP($E$21&$F9,'GW VOCs Table'!$A$9:$CG$5001,V$4,FALSE),#N/A)","v":{"$error":"#N/A"}}]
["Continuous System 3",10,"2012-01-01","Start","BOC-09","1994-09-01",{"$f":"IF(VLOOKUP($E$6&$F10,'GW VOCs Table'!$A$9:$CG$5001,G$4,FALSE)>0,VLOOKUP($E$6&$F10,'GW VOCs Table'!$A$9:$CG$5001,G$4,FALSE),#N/A)","v":{"$error":"#N/A"}},{"$f":"IF(VLOOKUP($E$7&$F10,'GW VOCs Table'!$A$9:$CG$5001,H$4,FALSE)>0,VLOOKUP($E$7&$F10,'GW VOCs Table'!$A$9:$CG$5001,H$4,FALSE),#N/A)","v":{"$error":"#N/A"}},{"$f":"IF(VLOOKUP($E$8&$F10,'GW VOCs Table'!$A$9:$CG$5001,I$4,FALSE)>0,VLOOKUP($E$8&$F10,'GW VOCs Table'!$A$9:$CG$5001,I$4,FALSE),#N/A)","v":{"$error":"#N/A"}},{"$f":"IF(VLOOKUP($E$9&$F10,'GW VOCs Table'!$A$9:$CG$5001,J$4,FALSE)>0,VLOOKUP($E$9&$F10,'GW VOCs Table'!$A$9:$CG$5001,J$4,FALSE),#N/A)","v":{"$error":"#N/A"}},{"$f":"IF(VLOOKUP($E$10&$F10,'GW VOCs Table'!$A$9:$CG$5001,K$4,FALSE)>0,VLOOKUP($E$10&$F10,'GW VOCs Table'!$A$9:$CG$5001,K$4,FALSE),#N/A)","v":{"$error":"#N/A"}},{"$f":"IF(VLOOKUP($E$11&$F10,'GW VOCs Table'!$A$9:$CG$5001,L$4,FALSE)>0,VLOOKUP($E$11&$F10,'GW VOCs Table'!$A$9:$CG$5001,L$4,FALSE),#N/A)","v":{"$error":"#N/A"}},{"$f":"IF(VLOOKUP($E$12&$F10,'GW VOCs Table'!$A$9:$CG$5001,M$4,FALSE)>0,VLOOKUP($E$12&$F10,'GW VOCs Table'!$A$9:$CG$5001,M$4,FALSE),#N/A)","v":{"$error":"#N/A"}},{"$f":"IF(VLOOKUP($E$13&$F10,'GW VOCs Table'!$A$9:$CG$5001,N$4,FALSE)>0,VLOOKUP($E$13&$F10,'GW VOCs Table'!$A$9:$CG$5001,N$4,FALSE),#N/A)","v":{"$error":"#N/A"}},{"$f":"IF(VLOOKUP($E$14&$F10,'GW VOCs Table'!$A$9:$CG$5001,O$4,FALSE)>0,VLOOKUP($E$14&$F10,'GW VOCs Table'!$A$9:$CG$5001,O$4,FALSE),#N/A)","v":{"$error":"#N/A"}},{"$f":"IF(VLOOKUP($E$15&$F10,'GW VOCs Table'!$A$9:$CG$5001,P$4,FALSE)>0,VLOOKUP($E$15&$F10,'GW VOCs Table'!$A$9:$CG$5001,P$4,FALSE),#N/A)","v":{"$error":"#N/A"}},{"$f":"IF(VLOOKUP($E$16&$F10,'GW VOCs Table'!$A$9:$CG$5001,Q$4,FALSE)>0,VLOOKUP($E$16&$F10,'GW VOCs Table'!$A$9:$CG$5001,Q$4,FALSE),#N/A)","v":{"$error":"#N/A"}},{"$f":"IF(VLOOKUP($E$17&$F10,'GW VOCs Table'!$A$9:$CG$5001,R$4,FALSE)>0,VLOOKUP($E$17&$F10,'GW VOCs Table'!$A$9:$CG$5001,R$4,FALSE),#N/A)","v":{"$error":"#N/A"}},{"$f":"IF(VLOOKUP($E$18&$F10,'GW VOCs Table'!$A$9:$CG$5001,S$4,FALSE)>0,VLOOKUP($E$18&$F10,'GW VOCs Table'!$A$9:$CG$5001,S$4,FALSE),#N/A)","v":{"$error":"#N/A"}},{"$f":"IF(VLOOKUP($E$19&$F10,'GW VOCs Table'!$A$9:$CG$5001,T$4,FALSE)>0,VLOOKUP($E$19&$F10,'GW VOCs Table'!$A$9:$CG$5001,T$4,FALSE),#N/A)","v":{"$error":"#N/A"}},{"$f":"IF(VLOOKUP($E$20&$F10,'GW VOCs Table'!$A$9:$CG$5001,U$4,FALSE)>0,VLOOKUP($E$20&$F10,'GW VOCs Table'!$A$9:$CG$5001,U$4,FALSE),#N/A)","v":{"$error":"#N/A"}},{"$f":"IF(VLOOKUP($E$21&$F10,'GW VOCs Table'!$A$9:$CG$5001,V$4,FALSE)>0,VLOOKUP($E$21&$F10,'GW VOCs Table'!$A$9:$CG$5001,V$4,FALSE),#N/A)","v":{"$error":"#N/A"}}]
[null,10,"2012-03-01","End","BOC-10","1995-03-09",{"$f":"IF(VLOOKUP($E$6&$F11,'GW VOCs Table'!$A$9:$CG$5001,G$4,FALSE)>0,VLOOKUP($E$6&$F11,'GW VOCs Table'!$A$9:$CG$5001,G$4,FALSE),#N/A)","v":{"$error":"#N/A"}},{"$f":"IF(VLOOKUP($E$7&$F11,'GW VOCs Table'!$A$9:$CG$5001,H$4,FALSE)>0,VLOOKUP($E$7&$F11,'GW VOCs Table'!$A$9:$CG$5001,H$4,FALSE),#N/A)","v":{"$error":"#N/A"}},{"$f":"IF(VLOOKUP($E$8&$F11,'GW VOCs Table'!$A$9:$CG$5001,I$4,FALSE)>0,VLOOKUP($E$8&$F11,'GW VOCs Table'!$A$9:$CG$5001,I$4,FALSE),#N/A)","v":{"$error":"#N/A"}},{"$f":"IF(VLOOKUP($E$9&$F11,'GW VOCs Table'!$A$9:$CG$5001,J$4,FALSE)>0,VLOOKUP($E$9&$F11,'GW VOCs Table'!$A$9:$CG$5001,J$4,FALSE),#N/A)","v":{"$error":"#N/A"}},{"$f":"IF(VLOOKUP($E$10&$F11,'GW VOCs Table'!$A$9:$CG$5001,K$4,FALSE)>0,VLOOKUP($E$10&$F11,'GW VOCs Table'!$A$9:$CG$5001,K$4,FALSE),#N/A)","v":{"$error":"#N/A"}},{"$f":"IF(VLOOKUP($E$11&$F11,'GW VOCs Table'!$A$9:$CG$5001,L$4,FALSE)>0,VLOOKUP($E$11&$F11,'GW VOCs Table'!$A$9:$CG$5001,L$4,FALSE),#N/A)","v":{"$error":"#N/A"}},{"$f":"IF(VLOOKUP($E$12&$F11,'GW VOCs Table'!$A$9:$CG$5001,M$4,FALSE)>0,VLOOKUP($E$12&$F11,'GW VOCs Table'!$A$9:$CG$5001,M$4,FALSE),#N/A)","v":{"$error":"#N/A"}},{"$f":"IF(VLOOKUP($E$13&$F11,'GW VOCs Table'!$A$9:$CG$5001,N$4,FALSE)>0,VLOOKUP($E$13&$F11,'GW VOCs Table'!$A$9:$CG$5001,N$4,FALSE),#N/A)","v":{"$error":"#N/A"}},{"$f":"IF(VLOOKUP($E$14&$F11,'GW VOCs Table'!$A$9:$CG$5001,O$4,FALSE)>0,VLOOKUP($E$14&$F11,'GW VOCs Table'!$A$9:$CG$5001,O$4,FALSE),#N/A)","v":{"$error":"#N/A"}},{"$f":"IF(VLOOKUP($E$15&$F11,'GW VOCs Table'!$A$9:$CG$5001,P$4,FALSE)>0,VLOOKUP($E$15&$F11,'GW VOCs Table'!$A$9:$CG$5001,P$4,FALSE),#N/A)","v":{"$error":"#N/A"}},{"$f":"IF(VLOOKUP($E$16&$F11,'GW VOCs Table'!$A$9:$CG$5001,Q$4,FALSE)>0,VLOOKUP($E$16&$F11,'GW VOCs Table'!$A$9:$CG$5001,Q$4,FALSE),#N/A)","v":{"$error":"#N/A"}},{"$f":"IF(VLOOKUP($E$17&$F11,'GW VOCs Table'!$A$9:$CG$5001,R$4,FALSE)>0,VLOOKUP($E$17&$F11,'GW VOCs Table'!$A$9:$CG$5001,R$4,FALSE),#N/A)","v":{"$error":"#N/A"}},{"$f":"IF(VLOOKUP($E$18&$F11,'GW VOCs Table'!$A$9:$CG$5001,S$4,FALSE)>0,VLOOKUP($E$18&$F11,'GW VOCs Table'!$A$9:$CG$5001,S$4,FALSE),#N/A)","v":{"$error":"#N/A"}},{"$f":"IF(VLOOKUP($E$19&$F11,'GW VOCs Table'!$A$9:$CG$5001,T$4,FALSE)>0,VLOOKUP($E$19&$F11,'GW VOCs Table'!$A$9:$CG$5001,T$4,FALSE),#N/A)","v":{"$error":"#N/A"}},{"$f":"IF(VLOOKUP($E$20&$F11,'GW VOCs Table'!$A$9:$CG$5001,U$4,FALSE)>0,VLOOKUP($E$20&$F11,'GW VOCs Table'!$A$9:$CG$5001,U$4,FALSE),#N/A)","v":{"$error":"#N/A"}},{"$f":"IF(VLOOKUP($E$21&$F11,'GW VOCs Table'!$A$9:$CG$5001,V$4,FALSE)>0,VLOOKUP($E$21&$F11,'GW VOCs Table'!$A$9:$CG$5001,V$4,FALSE),#N/A)","v":{"$error":"#N/A"}}]
["Continuous System 4",10,"2016-01-01","Start","BOC-11","1995-12-06",{"$f":"IF(VLOOKUP($E$6&$F12,'GW VOCs Table'!$A$9:$CG$5001,G$4,FALSE)>0,VLOOKUP($E$6&$F12,'GW VOCs Table'!$A$9:$CG$5001,G$4,FALSE),#N/A)","v":{"$error":"#N/A"}},{"$f":"IF(VLOOKUP($E$7&$F12,'GW VOCs Table'!$A$9:$CG$5001,H$4,FALSE)>0,VLOOKUP($E$7&$F12,'GW VOCs Table'!$A$9:$CG$5001,H$4,FALSE),#N/A)","v":{"$error":"#N/A"}},{"$f":"IF(VLOOKUP($E$8&$F12,'GW VOCs Table'!$A$9:$CG$5001,I$4,FALSE)>0,VLOOKUP($E$8&$F12,'GW VOCs Table'!$A$9:$CG$5001,I$4,FALSE),#N/A)","v":{"$error":"#N/A"}},{"$f":"IF(VLOOKUP($E$9&$F12,'GW VOCs Table'!$A$9:$CG$5001,J$4,FALSE)>0,VLOOKUP($E$9&$F12,'GW VOCs Table'!$A$9:$CG$5001,J$4,FALSE),#N/A)","v":{"$error":"#N/A"}},{"$f":"IF(VLOOKUP($E$10&$F12,'GW VOCs Table'!$A$9:$CG$5001,K$4,FALSE)>0,VLOOKUP($E$10&$F12,'GW VOCs Table'!$A$9:$CG$5001,K$4,FALSE),#N/A)","v":{"$error":"#N/A"}},{"$f":"IF(VLOOKUP($E$11&$F12,'GW VOCs Table'!$A$9:$CG$5001,L$4,FALSE)>0,VLOOKUP($E$11&$F12,'GW VOCs Table'!$A$9:$CG$5001,L$4,FALSE),#N/A)","v":{"$error":"#N/A"}},{"$f":"IF(VLOOKUP($E$12&$F12,'GW VOCs Table'!$A$9:$CG$5001,M$4,FALSE)>0,VLOOKUP($E$12&$F12,'GW VOCs Table'!$A$9:$CG$5001,M$4,FALSE),#N/A)","v":{"$error":"#N/A"}},{"$f":"IF(VLOOKUP($E$13&$F12,'GW VOCs Table'!$A$9:$CG$5001,N$4,FALSE)>0,VLOOKUP($E$13&$F12,'GW VOCs Table'!$A$9:$CG$5001,N$4,FALSE),#N/A)","v":{"$error":"#N/A"}},{"$f":"IF(VLOOKUP($E$14&$F12,'GW VOCs Table'!$A$9:$CG$5001,O$4,FALSE)>0,VLOOKUP($E$14&$F12,'GW VOCs Table'!$A$9:$CG$5001,O$4,FALSE),#N/A)","v":{"$error":"#N/A"}},{"$f":"IF(VLOOKUP($E$15&$F12,'GW VOCs Table'!$A$9:$CG$5001,P$4,FALSE)>0,VLOOKUP($E$15&$F12,'GW VOCs Table'!$A$9:$CG$5001,P$4,FALSE),#N/A)","v":{"$error":"#N/A"}},{"$f":"IF(VLOOKUP($E$16&$F12,'GW VOCs Table'!$A$9:$CG$5001,Q$4,FALSE)>0,VLOOKUP($E$16&$F12,'GW VOCs Table'!$A$9:$CG$5001,Q$4,FALSE),#N/A)","v":{"$error":"#N/A"}},{"$f":"IF(VLOOKUP($E$17&$F12,'GW VOCs Table'!$A$9:$CG$5001,R$4,FALSE)>0,VLOOKUP($E$17&$F12,'GW VOCs Table'!$A$9:$CG$5001,R$4,FALSE),#N/A)","v":{"$error":"#N/A"}},{"$f":"IF(VLOOKUP($E$18&$F12,'GW VOCs Table'!$A$9:$CG$5001,S$4,FALSE)>0,VLOOKUP($E$18&$F12,'GW VOCs Table'!$A$9:$CG$5001,S$4,FALSE),#N/A)","v":{"$error":"#N/A"}},{"$f":"IF(VLOOKUP($E$19&$F12,'GW VOCs Table'!$A$9:$CG$5001,T$4,FALSE)>0,VLOOKUP($E$19&$F12,'GW VOCs Table'!$A$9:$CG$5001,T$4,FALSE),#N/A)","v":{"$error":"#N/A"}},{"$f":"IF(VLOOKUP($E$20&$F12,'GW VOCs Table'!$A$9:$CG$5001,U$4,FALSE)>0,VLOOKUP($E$20&$F12,'GW VOCs Table'!$A$9:$CG$5001,U$4,FALSE),#N/A)","v":{"$error":"#N/A"}},{"$f":"IF(VLOOKUP($E$21&$F12,'GW VOCs Table'!$A$9:$CG$5001,V$4,FALSE)>0,VLOOKUP($E$21&$F12,'GW VOCs Table'!$A$9:$CG$5001,V$4,FALSE),#N/A)","v":{"$error":"#N/A"}}]
[null,10,"2020-01-01","End","BOC-12","2006-07-21",{"$f":"IF(VLOOKUP($E$6&$F13,'GW VOCs Table'!$A$9:$CG$5001,G$4,FALSE)>0,VLOOKUP($E$6&$F13,'GW VOCs Table'!$A$9:$CG$5001,G$4,FALSE),#N/A)","v":{"$error":"#N/A"}},{"$f":"IF(VLOOKUP($E$7&$F13,'GW VOCs Table'!$A$9:$CG$5001,H$4,FALSE)>0,VLOOKUP($E$7&$F13,'GW VOCs Table'!$A$9:$CG$5001,H$4,FALSE),#N/A)","v":{"$error":"#N/A"}},{"$f":"IF(VLOOKUP($E$8&$F13,'GW VOCs Table'!$A$9:$CG$5001,I$4,FALSE)>0,VLOOKUP($E$8&$F13,'GW VOCs Table'!$A$9:$CG$5001,I$4,FALSE),#N/A)","v":{"$error":"#N/A"}},{"$f":"IF(VLOOKUP($E$9&$F13,'GW VOCs Table'!$A$9:$CG$5001,J$4,FALSE)>0,VLOOKUP($E$9&$F13,'GW VOCs Table'!$A$9:$CG$5001,J$4,FALSE),#N/A)","v":{"$error":"#N/A"}},{"$f":"IF(VLOOKUP($E$10&$F13,'GW VOCs Table'!$A$9:$CG$5001,K$4,FALSE)>0,VLOOKUP($E$10&$F13,'GW VOCs Table'!$A$9:$CG$5001,K$4,FALSE),#N/A)","v":{"$error":"#N/A"}},{"$f":"IF(VLOOKUP($E$11&$F13,'GW VOCs Table'!$A$9:$CG$5001,L$4,FALSE)>0,VLOOKUP($E$11&$F13,'GW VOCs Table'!$A$9:$CG$5001,L$4,FALSE),#N/A)","v":{"$error":"#N/A"}},{"$f":"IF(VLOOKUP($E$12&$F13,'GW VOCs Table'!$A$9:$CG$5001,M$4,FALSE)>0,VLOOKUP($E$12&$F13,'GW VOCs Table'!$A$9:$CG$5001,M$4,FALSE),#N/A)","v":{"$error":"#N/A"}},{"$f":"IF(VLOOKUP($E$13&$F13,'GW VOCs Table'!$A$9:$CG$5001,N$4,FALSE)>0,VLOOKUP($E$13&$F13,'GW VOCs Table'!$A$9:$CG$5001,N$4,FALSE),#N/A)","v":{"$error":"#N/A"}},{"$f":"IF(VLOOKUP($E$14&$F13,'GW VOCs Table'!$A$9:$CG$5001,O$4,FALSE)>0,VLOOKUP($E$14&$F13,'GW VOCs Table'!$A$9:$CG$5001,O$4,FALSE),#N/A)","v":{"$error":"#N/A"}},{"$f":"IF(VLOOKUP($E$15&$F13,'GW VOCs Table'!$A$9:$CG$5001,P$4,FALSE)>0,VLOOKUP($E$15&$F13,'GW VOCs Table'!$A$9:$CG$5001,P$4,FALSE),#N/A)","v":{"$error":"#N/A"}},{"$f":"IF(VLOOKUP($E$16&$F13,'GW VOCs Table'!$A$9:$CG$5001,Q$4,FALSE)>0,VLOOKUP($E$16&$F13,'GW VOCs Table'!$A$9:$CG$5001,Q$4,FALSE),#N/A)","v":{"$error":"#N/A"}},{"$f":"IF(VLOOKUP($E$17&$F13,'GW VOCs Table'!$A$9:$CG$5001,R$4,FALSE)>0,VLOOKUP($E$17&$F13,'GW VOCs Table'!$A$9:$CG$5001,R$4,FALSE),#N/A)","v":{"$error":"#N/A"}},{"$f":"IF(VLOOKUP($E$18&$F13,'GW VOCs Table'!$A$9:$CG$5001,S$4,FALSE)>0,VLOOKUP($E$18&$F13,'GW VOCs Table'!$A$9:$CG$5001,S$4,FALSE),#N/A)","v":{"$error":"#N/A"}},{"$f":"IF(VLOOKUP($E$19&$F13,'GW VOCs Table'!$A$9:$CG$5001,T$4,FALSE)>0,VLOOKUP($E$19&$F13,'GW VOCs Table'!$A$9:$CG$5001,T$4,FALSE),#N/A)","v":{"$error":"#N/A"}},{"$f":"IF(VLOOKUP($E$20&$F13,'GW VOCs Table'!$A$9:$CG$5001,U$4,FALSE)>0,VLOOKUP($E$20&$F13,'GW VOCs Table'!$A$9:$CG$5001,U$4,FALSE),#N/A)","v":{"$error":"#N/A"}},{"$f":"IF(VLOOKUP($E$21&$F13,'GW VOCs Table'!$A$9:$CG$5001,V$4,FALSE)>0,VLOOKUP($E$21&$F13,'GW VOCs Table'!$A$9:$CG$5001,V$4,FALSE),#N/A)","v":{"$error":"#N/A"}}]
["Continuous System 5",10,"2020-03-01","Start","BOC-13","2008-03-25",{"$f":"IF(VLOOKUP($E$6&$F14,'GW VOCs Table'!$A$9:$CG$5001,G$4,FALSE)>0,VLOOKUP($E$6&$F14,'GW VOCs Table'!$A$9:$CG$5001,G$4,FALSE),#N/A)","v":{"$error":"#N/A"}},{"$f":"IF(VLOOKUP($E$7&$F14,'GW VOCs Table'!$A$9:$CG$5001,H$4,FALSE)>0,VLOOKUP($E$7&$F14,'GW VOCs Table'!$A$9:$CG$5001,H$4,FALSE),#N/A)","v":{"$error":"#N/A"}},{"$f":"IF(VLOOKUP($E$8&$F14,'GW VOCs Table'!$A$9:$CG$5001,I$4,FALSE)>0,VLOOKUP($E$8&$F14,'GW VOCs Table'!$A$9:$CG$5001,I$4,FALSE),#N/A)","v":{"$error":"#N/A"}},{"$f":"IF(VLOOKUP($E$9&$F14,'GW VOCs Table'!$A$9:$CG$5001,J$4,FALSE)>0,VLOOKUP($E$9&$F14,'GW VOCs Table'!$A$9:$CG$5001,J$4,FALSE),#N/A)","v":{"$error":"#N/A"}},{"$f":"IF(VLOOKUP($E$10&$F14,'GW VOCs Table'!$A$9:$CG$5001,K$4,FALSE)>0,VLOOKUP($E$10&$F14,'GW VOCs Table'!$A$9:$CG$5001,K$4,FALSE),#N/A)","v":{"$error":"#N/A"}},{"$f":"IF(VLOOKUP($E$11&$F14,'GW VOCs Table'!$A$9:$CG$5001,L$4,FALSE)>0,VLOOKUP($E$11&$F14,'GW VOCs Table'!$A$9:$CG$5001,L$4,FALSE),#N/A)","v":{"$error":"#N/A"}},{"$f":"IF(VLOOKUP($E$12&$F14,'GW VOCs Table'!$A$9:$CG$5001,M$4,FALSE)>0,VLOOKUP($E$12&$F14,'GW VOCs Table'!$A$9:$CG$5001,M$4,FALSE),#N/A)","v":{"$error":"#N/A"}},{"$f":"IF(VLOOKUP($E$13&$F14,'GW VOCs Table'!$A$9:$CG$5001,N$4,FALSE)>0,VLOOKUP($E$13&$F14,'GW VOCs Table'!$A$9:$CG$5001,N$4,FALSE),#N/A)","v":{"$error":"#N/A"}},{"$f":"IF(VLOOKUP($E$14&$F14,'GW VOCs Table'!$A$9:$CG$5001,O$4,FALSE)>0,VLOOKUP($E$14&$F14,'GW VOCs Table'!$A$9:$CG$5001,O$4,FALSE),#N/A)","v":{"$error":"#N/A"}},{"$f":"IF(VLOOKUP($E$15&$F14,'GW VOCs Table'!$A$9:$CG$5001,P$4,FALSE)>0,VLOOKUP($E$15&$F14,'GW VOCs Table'!$A$9:$CG$5001,P$4,FALSE),#N/A)","v":{"$error":"#N/A"}},{"$f":"IF(VLOOKUP($E$16&$F14,'GW VOCs Table'!$A$9:$CG$5001,Q$4,FALSE)>0,VLOOKUP($E$16&$F14,'GW VOCs Table'!$A$9:$CG$5001,Q$4,FALSE),#N/A)","v":{"$error":"#N/A"}},{"$f":"IF(VLOOKUP($E$17&$F14,'GW VOCs Table'!$A$9:$CG$5001,R$4,FALSE)>0,VLOOKUP($E$17&$F14,'GW VOCs Table'!$A$9:$CG$5001,R$4,FALSE),#N/A)","v":{"$error":"#N/A"}},{"$f":"IF(VLOOKUP($E$18&$F14,'GW VOCs Table'!$A$9:$CG$5001,S$4,FALSE)>0,VLOOKUP($E$18&$F14,'GW VOCs Table'!$A$9:$CG$5001,S$4,FALSE),#N/A)","v":{"$error":"#N/A"}},{"$f":"IF(VLOOKUP($E$19&$F14,'GW VOCs Table'!$A$9:$CG$5001,T$4,FALSE)>0,VLOOKUP($E$19&$F14,'GW VOCs Table'!$A$9:$CG$5001,T$4,FALSE),#N/A)","v":{"$error":"#N/A"}},{"$f":"IF(VLOOKUP($E$20&$F14,'GW VOCs Table'!$A$9:$CG$5001,U$4,FALSE)>0,VLOOKUP($E$20&$F14,'GW VOCs Table'!$A$9:$CG$5001,U$4,FALSE),#N/A)","v":{"$error":"#N/A"}},{"$f":"IF(VLOOKUP($E$21&$F14,'GW VOCs Table'!$A$9:$CG$5001,V$4,FALSE)>0,VLOOKUP($E$21&$F14,'GW VOCs Table'!$A$9:$CG$5001,V$4,FALSE),#N/A)","v":{"$error":"#N/A"}}]
[null,10,{"$f":"TODAY()","v":"2022-09-22"},"End","BOC-14","2009-10-15",{"$f":"IF(VLOOKUP($E$6&$F15,'GW VOCs Table'!$A$9:$CG$5001,G$4,FALSE)>0,VLOOKUP($E$6&$F15,'GW VOCs Table'!$A$9:$CG$5001,G$4,FALSE),#N/A)","v":{"$error":"#N/A"}},{"$f":"IF(VLOOKUP($E$7&$F15,'GW VOCs Table'!$A$9:$CG$5001,H$4,FALSE)>0,VLOOKUP($E$7&$F15,'GW VOCs Table'!$A$9:$CG$5001,H$4,FALSE),#N/A)","v":{"$error":"#N/A"}},{"$f":"IF(VLOOKUP($E$8&$F15,'GW VOCs Table'!$A$9:$CG$5001,I$4,FALSE)>0,VLOOKUP($E$8&$F15,'GW VOCs Table'!$A$9:$CG$5001,I$4,FALSE),#N/A)","v":{"$error":"#N/A"}},{"$f":"IF(VLOOKUP($E$9&$F15,'GW VOCs Table'!$A$9:$CG$5001,J$4,FALSE)>0,VLOOKUP($E$9&$F15,'GW VOCs Table'!$A$9:$CG$5001,J$4,FALSE),#N/A)","v":{"$error":"#N/A"}},{"$f":"IF(VLOOKUP($E$10&$F15,'GW VOCs Table'!$A$9:$CG$5001,K$4,FALSE)>0,VLOOKUP($E$10&$F15,'GW VOCs Table'!$A$9:$CG$5001,K$4,FALSE),#N/A)","v":{"$error":"#N/A"}},{"$f":"IF(VLOOKUP($E$11&$F15,'GW VOCs Table'!$A$9:$CG$5001,L$4,FALSE)>0,VLOOKUP($E$11&$F15,'GW VOCs Table'!$A$9:$CG$5001,L$4,FALSE),#N/A)","v":{"$error":"#N/A"}},{"$f":"IF(VLOOKUP($E$12&$F15,'GW VOCs Table'!$A$9:$CG$5001,M$4,FALSE)>0,VLOOKUP($E$12&$F15,'GW VOCs Table'!$A$9:$CG$5001,M$4,FALSE),#N/A)","v":{"$error":"#N/A"}},{"$f":"IF(VLOOKUP($E$13&$F15,'GW VOCs Table'!$A$9:$CG$5001,N$4,FALSE)>0,VLOOKUP($E$13&$F15,'GW VOCs Table'!$A$9:$CG$5001,N$4,FALSE),#N/A)","v":{"$error":"#N/A"}},{"$f":"IF(VLOOKUP($E$14&$F15,'GW VOCs Table'!$A$9:$CG$5001,O$4,FALSE)>0,VLOOKUP($E$14&$F15,'GW VOCs Table'!$A$9:$CG$5001,O$4,FALSE),#N/A)","v":{"$error":"#N/A"}},{"$f":"IF(VLOOKUP($E$15&$F15,'GW VOCs Table'!$A$9:$CG$5001,P$4,FALSE)>0,VLOOKUP($E$15&$F15,'GW VOCs Table'!$A$9:$CG$5001,P$4,FALSE),#N/A)","v":{"$error":"#N/A"}},{"$f":"IF(VLOOKUP($E$16&$F15,'GW VOCs Table'!$A$9:$CG$5001,Q$4,FALSE)>0,VLOOKUP($E$16&$F15,'GW VOCs Table'!$A$9:$CG$5001,Q$4,FALSE),#N/A)","v":{"$error":"#N/A"}},{"$f":"IF(VLOOKUP($E$17&$F15,'GW VOCs Table'!$A$9:$CG$5001,R$4,FALSE)>0,VLOOKUP($E$17&$F15,'GW VOCs Table'!$A$9:$CG$5001,R$4,FALSE),#N/A)","v":{"$error":"#N/A"}},{"$f":"IF(VLOOKUP($E$18&$F15,'GW VOCs Table'!$A$9:$CG$5001,S$4,FALSE)>0,VLOOKUP($E$18&$F15,'GW VOCs Table'!$A$9:$CG$5001,S$4,FALSE),#N/A)","v":{"$error":"#N/A"}},{"$f":"IF(VLOOKUP($E$19&$F15,'GW VOCs Table'!$A$9:$CG$5001,T$4,FALSE)>0,VLOOKUP($E$19&$F15,'GW VOCs Table'!$A$9:$CG$5001,T$4,FALSE),#N/A)","v":{"$error":"#N/A"}},{"$f":"IF(VLOOKUP($E$20&$F15,'GW VOCs Table'!$A$9:$CG$5001,U$4,FALSE)>0,VLOOKUP($E$20&$F15,'GW VOCs Table'!$A$9:$CG$5001,U$4,FALSE),#N/A)","v":{"$error":"#N/A"}},{"$f":"IF(VLOOKUP($E$21&$F15,'GW VOCs Table'!$A$9:$CG$5001,V$4,FALSE)>0,VLOOKUP($E$21&$F15,'GW VOCs Table'!$A$9:$CG$5001,V$4,FALSE),#N/A)","v":{"$error":"#N/A"}}]
["In-situ Treatment Event 1",10,"2000-01-01","Start","DP-02","2010-04-08",{"$f":"IF(VLOOKUP($E$6&$F16,'GW VOCs Table'!$A$9:$CG$5001,G$4,FALSE)>0,VLOOKUP($E$6&$F16,'GW VOCs Table'!$A$9:$CG$5001,G$4,FALSE),#N/A)","v":{"$error":"#N/A"}},{"$f":"IF(VLOOKUP($E$7&$F16,'GW VOCs Table'!$A$9:$CG$5001,H$4,FALSE)>0,VLOOKUP($E$7&$F16,'GW VOCs Table'!$A$9:$CG$5001,H$4,FALSE),#N/A)","v":{"$error":"#N/A"}},{"$f":"IF(VLOOKUP($E$8&$F16,'GW VOCs Table'!$A$9:$CG$5001,I$4,FALSE)>0,VLOOKUP($E$8&$F16,'GW VOCs Table'!$A$9:$CG$5001,I$4,FALSE),#N/A)","v":{"$error":"#N/A"}},{"$f":"IF(VLOOKUP($E$9&$F16,'GW VOCs Table'!$A$9:$CG$5001,J$4,FALSE)>0,VLOOKUP($E$9&$F16,'GW VOCs Table'!$A$9:$CG$5001,J$4,FALSE),#N/A)","v":{"$error":"#N/A"}},{"$f":"IF(VLOOKUP($E$10&$F16,'GW VOCs Table'!$A$9:$CG$5001,K$4,FALSE)>0,VLOOKUP($E$10&$F16,'GW VOCs Table'!$A$9:$CG$5001,K$4,FALSE),#N/A)","v":{"$error":"#N/A"}},{"$f":"IF(VLOOKUP($E$11&$F16,'GW VOCs Table'!$A$9:$CG$5001,L$4,FALSE)>0,VLOOKUP($E$11&$F16,'GW VOCs Table'!$A$9:$CG$5001,L$4,FALSE),#N/A)","v":{"$error":"#N/A"}},{"$f":"IF(VLOOKUP($E$12&$F16,'GW VOCs Table'!$A$9:$CG$5001,M$4,FALSE)>0,VLOOKUP($E$12&$F16,'GW VOCs Table'!$A$9:$CG$5001,M$4,FALSE),#N/A)","v":{"$error":"#N/A"}},{"$f":"IF(VLOOKUP($E$13&$F16,'GW VOCs Table'!$A$9:$CG$5001,N$4,FALSE)>0,VLOOKUP($E$13&$F16,'GW VOCs Table'!$A$9:$CG$5001,N$4,FALSE),#N/A)","v":{"$error":"#N/A"}},{"$f":"IF(VLOOKUP($E$14&$F16,'GW VOCs Table'!$A$9:$CG$5001,O$4,FALSE)>0,VLOOKUP($E$14&$F16,'GW VOCs Table'!$A$9:$CG$5001,O$4,FALSE),#N/A)","v":{"$error":"#N/A"}},{"$f":"IF(VLOOKUP($E$15&$F16,'GW VOCs Table'!$A$9:$CG$5001,P$4,FALSE)>0,VLOOKUP($E$15&$F16,'GW VOCs Table'!$A$9:$CG$5001,P$4,FALSE),#N/A)","v":{"$error":"#N/A"}},{"$f":"IF(VLOOKUP($E$16&$F16,'GW VOCs Table'!$A$9:$CG$5001,Q$4,FALSE)>0,VLOOKUP($E$16&$F16,'GW VOCs Table'!$A$9:$CG$5001,Q$4,FALSE),#N/A)","v":{"$error":"#N/A"}},{"$f":"IF(VLOOKUP($E$17&$F16,'GW VOCs Table'!$A$9:$CG$5001,R$4,FALSE)>0,VLOOKUP($E$17&$F16,'GW VOCs Table'!$A$9:$CG$5001,R$4,FALSE),#N/A)","v":{"$error":"#N/A"}},{"$f":"IF(VLOOKUP($E$18&$F16,'GW VOCs Table'!$A$9:$CG$5001,S$4,FALSE)>0,VLOOKUP($E$18&$F16,'GW VOCs Table'!$A$9:$CG$5001,S$4,FALSE),#N/A)","v":{"$error":"#N/A"}},{"$f":"IF(VLOOKUP($E$19&$F16,'GW VOCs Table'!$A$9:$CG$5001,T$4,FALSE)>0,VLOOKUP($E$19&$F16,'GW VOCs Table'!$A$9:$CG$5001,T$4,FALSE),#N/A)","v":{"$error":"#N/A"}},{"$f":"IF(VLOOKUP($E$20&$F16,'GW VOCs Table'!$A$9:$CG$5001,U$4,FALSE)>0,VLOOKUP($E$20&$F16,'GW VOCs Table'!$A$9:$CG$5001,U$4,FALSE),#N/A)","v":{"$error":"#N/A"}},{"$f":"IF(VLOOKUP($E$21&$F16,'GW VOCs Table'!$A$9:$CG$5001,V$4,FALSE)>0,VLOOKUP($E$21&$F16,'GW VOCs Table'!$A$9:$CG$5001,V$4,FALSE),#N/A)","v":{"$error":"#N/A"}}]
[null,10,"2004-01-01","End","DP-03","2011-10-19",{"$f":"IF(VLOOKUP($E$6&$F17,'GW VOCs Table'!$A$9:$CG$5001,G$4,FALSE)>0,VLOOKUP($E$6&$F17,'GW VOCs Table'!$A$9:$CG$5001,G$4,FALSE),#N/A)","v":{"$error":"#N/A"}},{"$f":"IF(VLOOKUP($E$7&$F17,'GW VOCs Table'!$A$9:$CG$5001,H$4,FALSE)>0,VLOOKUP($E$7&$F17,'GW VOCs Table'!$A$9:$CG$5001,H$4,FALSE),#N/A)","v":{"$error":"#N/A"}},{"$f":"IF(VLOOKUP($E$8&$F17,'GW VOCs Table'!$A$9:$CG$5001,I$4,FALSE)>0,VLOOKUP($E$8&$F17,'GW VOCs Table'!$A$9:$CG$5001,I$4,FALSE),#N/A)","v":{"$error":"#N/A"}},{"$f":"IF(VLOOKUP($E$9&$F17,'GW VOCs Table'!$A$9:$CG$5001,J$4,FALSE)>0,VLOOKUP($E$9&$F17,'GW VOCs Table'!$A$9:$CG$5001,J$4,FALSE),#N/A)","v":{"$error":"#N/A"}},{"$f":"IF(VLOOKUP($E$10&$F17,'GW VOCs Table'!$A$9:$CG$5001,K$4,FALSE)>0,VLOOKUP($E$10&$F17,'GW VOCs Table'!$A$9:$CG$5001,K$4,FALSE),#N/A)","v":{"$error":"#N/A"}},{"$f":"IF(VLOOKUP($E$11&$F17,'GW VOCs Table'!$A$9:$CG$5001,L$4,FALSE)>0,VLOOKUP($E$11&$F17,'GW VOCs Table'!$A$9:$CG$5001,L$4,FALSE),#N/A)","v":{"$error":"#N/A"}},{"$f":"IF(VLOOKUP($E$12&$F17,'GW VOCs Table'!$A$9:$CG$5001,M$4,FALSE)>0,VLOOKUP($E$12&$F17,'GW VOCs Table'!$A$9:$CG$5001,M$4,FALSE),#N/A)","v":{"$error":"#N/A"}},{"$f":"IF(VLOOKUP($E$13&$F17,'GW VOCs Table'!$A$9:$CG$5001,N$4,FALSE)>0,VLOOKUP($E$13&$F17,'GW VOCs Table'!$A$9:$CG$5001,N$4,FALSE),#N/A)","v":{"$error":"#N/A"}},{"$f":"IF(VLOOKUP($E$14&$F17,'GW VOCs Table'!$A$9:$CG$5001,O$4,FALSE)>0,VLOOKUP($E$14&$F17,'GW VOCs Table'!$A$9:$CG$5001,O$4,FALSE),#N/A)","v":{"$error":"#N/A"}},{"$f":"IF(VLOOKUP($E$15&$F17,'GW VOCs Table'!$A$9:$CG$5001,P$4,FALSE)>0,VLOOKUP($E$15&$F17,'GW VOCs Table'!$A$9:$CG$5001,P$4,FALSE),#N/A)","v":{"$error":"#N/A"}},{"$f":"IF(VLOOKUP($E$16&$F17,'GW VOCs Table'!$A$9:$CG$5001,Q$4,FALSE)>0,VLOOKUP($E$16&$F17,'GW VOCs Table'!$A$9:$CG$5001,Q$4,FALSE),#N/A)","v":{"$error":"#N/A"}},{"$f":"IF(VLOOKUP($E$17&$F17,'GW VOCs Table'!$A$9:$CG$5001,R$4,FALSE)>0,VLOOKUP($E$17&$F17,'GW VOCs Table'!$A$9:$CG$5001,R$4,FALSE),#N/A)","v":{"$error":"#N/A"}},{"$f":"IF(VLOOKUP($E$18&$F17,'GW VOCs Table'!$A$9:$CG$5001,S$4,FALSE)>0,VLOOKUP($E$18&$F17,'GW VOCs Table'!$A$9:$CG$5001,S$4,FALSE),#N/A)","v":{"$error":"#N/A"}},{"$f":"IF(VLOOKUP($E$19&$F17,'GW VOCs Table'!$A$9:$CG$5001,T$4,FALSE)>0,VLOOKUP($E$19&$F17,'GW VOCs Table'!$A$9:$CG$5001,T$4,FALSE),#N/A)","v":{"$error":"#N/A"}},{"$f":"IF(VLOOKUP($E$20&$F17,'GW VOCs Table'!$A$9:$CG$5001,U$4,FALSE)>0,VLOOKUP($E$20&$F17,'GW VOCs Table'!$A$9:$CG$5001,U$4,FALSE),#N/A)","v":{"$error":"#N/A"}},{"$f":"IF(VLOOKUP($E$21&$F17,'GW VOCs Table'!$A$9:$CG$5001,V$4,FALSE)>0,VLOOKUP($E$21&$F17,'GW VOCs Table'!$A$9:$CG$5001,V$4,FALSE),#N/A)","v":{"$error":"#N/A"}}]
["In-situ Treatment Event 2",10,"2004-03-01","Start","DP-04","2013-04-19",{"$f":"IF(VLOOKUP($E$6&$F18,'GW VOCs Table'!$A$9:$CG$5001,G$4,FALSE)>0,VLOOKUP($E$6&$F18,'GW VOCs Table'!$A$9:$CG$5001,G$4,FALSE),#N/A)","v":{"$error":"#N/A"}},{"$f":"IF(VLOOKUP($E$7&$F18,'GW VOCs Table'!$A$9:$CG$5001,H$4,FALSE)>0,VLOOKUP($E$7&$F18,'GW VOCs Table'!$A$9:$CG$5001,H$4,FALSE),#N/A)","v":{"$error":"#N/A"}},{"$f":"IF(VLOOKUP($E$8&$F18,'GW VOCs Table'!$A$9:$CG$5001,I$4,FALSE)>0,VLOOKUP($E$8&$F18,'GW VOCs Table'!$A$9:$CG$5001,I$4,FALSE),#N/A)","v":{"$error":"#N/A"}},{"$f":"IF(VLOOKUP($E$9&$F18,'GW VOCs Table'!$A$9:$CG$5001,J$4,FALSE)>0,VLOOKUP($E$9&$F18,'GW VOCs Table'!$A$9:$CG$5001,J$4,FALSE),#N/A)","v":{"$error":"#N/A"}},{"$f":"IF(VLOOKUP($E$10&$F18,'GW VOCs Table'!$A$9:$CG$5001,K$4,FALSE)>0,VLOOKUP($E$10&$F18,'GW VOCs Table'!$A$9:$CG$5001,K$4,FALSE),#N/A)","v":{"$error":"#N/A"}},{"$f":"IF(VLOOKUP($E$11&$F18,'GW VOCs Table'!$A$9:$CG$5001,L$4,FALSE)>0,VLOOKUP($E$11&$F18,'GW VOCs Table'!$A$9:$CG$5001,L$4,FALSE),#N/A)","v":{"$error":"#N/A"}},{"$f":"IF(VLOOKUP($E$12&$F18,'GW VOCs Table'!$A$9:$CG$5001,M$4,FALSE)>0,VLOOKUP($E$12&$F18,'GW VOCs Table'!$A$9:$CG$5001,M$4,FALSE),#N/A)","v":{"$error":"#N/A"}},{"$f":"IF(VLOOKUP($E$13&$F18,'GW VOCs Table'!$A$9:$CG$5001,N$4,FALSE)>0,VLOOKUP($E$13&$F18,'GW VOCs Table'!$A$9:$CG$5001,N$4,FALSE),#N/A)","v":{"$error":"#N/A"}},{"$f":"IF(VLOOKUP($E$14&$F18,'GW VOCs Table'!$A$9:$CG$5001,O$4,FALSE)>0,VLOOKUP($E$14&$F18,'GW VOCs Table'!$A$9:$CG$5001,O$4,FALSE),#N/A)","v":{"$error":"#N/A"}},{"$f":"IF(VLOOKUP($E$15&$F18,'GW VOCs Table'!$A$9:$CG$5001,P$4,FALSE)>0,VLOOKUP($E$15&$F18,'GW VOCs Table'!$A$9:$CG$5001,P$4,FALSE),#N/A)","v":{"$error":"#N/A"}},{"$f":"IF(VLOOKUP($E$16&$F18,'GW VOCs Table'!$A$9:$CG$5001,Q$4,FALSE)>0,VLOOKUP($E$16&$F18,'GW VOCs Table'!$A$9:$CG$5001,Q$4,FALSE),#N/A)","v":{"$error":"#N/A"}},{"$f":"IF(VLOOKUP($E$17&$F18,'GW VOCs Table'!$A$9:$CG$5001,R$4,FALSE)>0,VLOOKUP($E$17&$F18,'GW VOCs Table'!$A$9:$CG$5001,R$4,FALSE),#N/A)","v":{"$error":"#N/A"}},{"$f":"IF(VLOOKUP($E$18&$F18,'GW VOCs Table'!$A$9:$CG$5001,S$4,FALSE)>0,VLOOKUP($E$18&$F18,'GW VOCs Table'!$A$9:$CG$5001,S$4,FALSE),#N/A)","v":{"$error":"#N/A"}},{"$f":"IF(VLOOKUP($E$19&$F18,'GW VOCs Table'!$A$9:$CG$5001,T$4,FALSE)>0,VLOOKUP($E$19&$F18,'GW VOCs Table'!$A$9:$CG$5001,T$4,FALSE),#N/A)","v":{"$error":"#N/A"}},{"$f":"IF(VLOOKUP($E$20&$F18,'GW VOCs Table'!$A$9:$CG$5001,U$4,FALSE)>0,VLOOKUP($E$20&$F18,'GW VOCs Table'!$A$9:$CG$5001,U$4,FALSE),#N/A)","v":{"$error":"#N/A"}},{"$f":"IF(VLOOKUP($E$21&$F18,'GW VOCs Table'!$A$9:$CG$5001,V$4,FALSE)>0,VLOOKUP($E$21&$F18,'GW VOCs Table'!$A$9:$CG$5001,V$4,FALSE),#N/A)","v":{"$error":"#N/A"}}]
[null,10,"2008-01-01","End","MW-06","2014-06-29",{"$f":"IF(VLOOKUP($E$6&$F19,'GW VOCs Table'!$A$9:$CG$5001,G$4,FALSE)>0,VLOOKUP($E$6&$F19,'GW VOCs Table'!$A$9:$CG$5001,G$4,FALSE),#N/A)","v":{"$error":"#N/A"}},{"$f":"IF(VLOOKUP($E$7&$F19,'GW VOCs Table'!$A$9:$CG$5001,H$4,FALSE)>0,VLOOKUP($E$7&$F19,'GW VOCs Table'!$A$9:$CG$5001,H$4,FALSE),#N/A)","v":{"$error":"#N/A"}},{"$f":"IF(VLOOKUP($E$8&$F19,'GW VOCs Table'!$A$9:$CG$5001,I$4,FALSE)>0,VLOOKUP($E$8&$F19,'GW VOCs Table'!$A$9:$CG$5001,I$4,FALSE),#N/A)","v":{"$error":"#N/A"}},{"$f":"IF(VLOOKUP($E$9&$F19,'GW VOCs Table'!$A$9:$CG$5001,J$4,FALSE)>0,VLOOKUP($E$9&$F19,'GW VOCs Table'!$A$9:$CG$5001,J$4,FALSE),#N/A)","v":{"$error":"#N/A"}},{"$f":"IF(VLOOKUP($E$10&$F19,'GW VOCs Table'!$A$9:$CG$5001,K$4,FALSE)>0,VLOOKUP($E$10&$F19,'GW VOCs Table'!$A$9:$CG$5001,K$4,FALSE),#N/A)","v":{"$error":"#N/A"}},{"$f":"IF(VLOOKUP($E$11&$F19,'GW VOCs Table'!$A$9:$CG$5001,L$4,FALSE)>0,VLOOKUP($E$11&$F19,'GW VOCs Table'!$A$9:$CG$5001,L$4,FALSE),#N/A)","v":{"$error":"#N/A"}},{"$f":"IF(VLOOKUP($E$12&$F19,'GW VOCs Table'!$A$9:$CG$5001,M$4,FALSE)>0,VLOOKUP($E$12&$F19,'GW VOCs Table'!$A$9:$CG$5001,M$4,FALSE),#N/A)","v":{"$error":"#N/A"}},{"$f":"IF(VLOOKUP($E$13&$F19,'GW VOCs Table'!$A$9:$CG$5001,N$4,FALSE)>0,VLOOKUP($E$13&$F19,'GW VOCs Table'!$A$9:$CG$5001,N$4,FALSE),#N/A)","v":{"$error":"#N/A"}},{"$f":"IF(VLOOKUP($E$14&$F19,'GW VOCs Table'!$A$9:$CG$5001,O$4,FALSE)>0,VLOOKUP($E$14&$F19,'GW VOCs Table'!$A$9:$CG$5001,O$4,FALSE),#N/A)","v":{"$error":"#N/A"}},{"$f":"IF(VLOOKUP($E$15&$F19,'GW VOCs Table'!$A$9:$CG$5001,P$4,FALSE)>0,VLOOKUP($E$15&$F19,'GW VOCs Table'!$A$9:$CG$5001,P$4,FALSE),#N/A)","v":{"$error":"#N/A"}},{"$f":"IF(VLOOKUP($E$16&$F19,'GW VOCs Table'!$A$9:$CG$5001,Q$4,FALSE)>0,VLOOKUP($E$16&$F19,'GW VOCs Table'!$A$9:$CG$5001,Q$4,FALSE),#N/A)","v":{"$error":"#N/A"}},{"$f":"IF(VLOOKUP($E$17&$F19,'GW VOCs Table'!$A$9:$CG$5001,R$4,FALSE)>0,VLOOKUP($E$17&$F19,'GW VOCs Table'!$A$9:$CG$5001,R$4,FALSE),#N/A)","v":{"$error":"#N/A"}},{"$f":"IF(VLOOKUP($E$18&$F19,'GW VOCs Table'!$A$9:$CG$5001,S$4,FALSE)>0,VLOOKUP($E$18&$F19,'GW VOCs Table'!$A$9:$CG$5001,S$4,FALSE),#N/A)","v":{"$error":"#N/A"}},{"$f":"IF(VLOOKUP($E$19&$F19,'GW VOCs Table'!$A$9:$CG$5001,T$4,FALSE)>0,VLOOKUP($E$19&$F19,'GW VOCs Table'!$A$9:$CG$5001,T$4,FALSE),#N/A)","v":{"$error":"#N/A"}},{"$f":"IF(VLOOKUP($E$20&$F19,'GW VOCs Table'!$A$9:$CG$5001,U$4,FALSE)>0,VLOOKUP($E$20&$F19,'GW VOCs Table'!$A$9:$CG$5001,U$4,FALSE),#N/A)","v":{"$error":"#N/A"}},{"$f":"IF(VLOOKUP($E$21&$F19,'GW VOCs Table'!$A$9:$CG$5001,V$4,FALSE)>0,VLOOKUP($E$21&$F19,'GW VOCs Table'!$A$9:$CG$5001,V$4,FALSE),#N/A)","v":{"$error":"#N/A"}}]
["In-situ Treatment Event 3",10,"2012-01-01","Start","MW-15","2014-11-11",{"$f":"IF(VLOOKUP($E$6&$F20,'GW VOCs Table'!$A$9:$CG$5001,G$4,FALSE)>0,VLOOKUP($E$6&$F20,'GW VOCs Table'!$A$9:$CG$5001,G$4,FALSE),#N/A)","v":{"$error":"#N/A"}},{"$f":"IF(VLOOKUP($E$7&$F20,'GW VOCs Table'!$A$9:$CG$5001,H$4,FALSE)>0,VLOOKUP($E$7&$F20,'GW VOCs Table'!$A$9:$CG$5001,H$4,FALSE),#N/A)","v":{"$error":"#N/A"}},{"$f":"IF(VLOOKUP($E$8&$F20,'GW VOCs Table'!$A$9:$CG$5001,I$4,FALSE)>0,VLOOKUP($E$8&$F20,'GW VOCs Table'!$A$9:$CG$5001,I$4,FALSE),#N/A)","v":{"$error":"#N/A"}},{"$f":"IF(VLOOKUP($E$9&$F20,'GW VOCs Table'!$A$9:$CG$5001,J$4,FALSE)>0,VLOOKUP($E$9&$F20,'GW VOCs Table'!$A$9:$CG$5001,J$4,FALSE),#N/A)","v":{"$error":"#N/A"}},{"$f":"IF(VLOOKUP($E$10&$F20,'GW VOCs Table'!$A$9:$CG$5001,K$4,FALSE)>0,VLOOKUP($E$10&$F20,'GW VOCs Table'!$A$9:$CG$5001,K$4,FALSE),#N/A)","v":{"$error":"#N/A"}},{"$f":"IF(VLOOKUP($E$11&$F20,'GW VOCs Table'!$A$9:$CG$5001,L$4,FALSE)>0,VLOOKUP($E$11&$F20,'GW VOCs Table'!$A$9:$CG$5001,L$4,FALSE),#N/A)","v":{"$error":"#N/A"}},{"$f":"IF(VLOOKUP($E$12&$F20,'GW VOCs Table'!$A$9:$CG$5001,M$4,FALSE)>0,VLOOKUP($E$12&$F20,'GW VOCs Table'!$A$9:$CG$5001,M$4,FALSE),#N/A)","v":{"$error":"#N/A"}},{"$f":"IF(VLOOKUP($E$13&$F20,'GW VOCs Table'!$A$9:$CG$5001,N$4,FALSE)>0,VLOOKUP($E$13&$F20,'GW VOCs Table'!$A$9:$CG$5001,N$4,FALSE),#N/A)","v":{"$error":"#N/A"}},{"$f":"IF(VLOOKUP($E$14&$F20,'GW VOCs Table'!$A$9:$CG$5001,O$4,FALSE)>0,VLOOKUP($E$14&$F20,'GW VOCs Table'!$A$9:$CG$5001,O$4,FALSE),#N/A)","v":{"$error":"#N/A"}},{"$f":"IF(VLOOKUP($E$15&$F20,'GW VOCs Table'!$A$9:$CG$5001,P$4,FALSE)>0,VLOOKUP($E$15&$F20,'GW VOCs Table'!$A$9:$CG$5001,P$4,FALSE),#N/A)","v":{"$error":"#N/A"}},{"$f":"IF(VLOOKUP($E$16&$F20,'GW VOCs Table'!$A$9:$CG$5001,Q$4,FALSE)>0,VLOOKUP($E$16&$F20,'GW VOCs Table'!$A$9:$CG$5001,Q$4,FALSE),#N/A)","v":{"$error":"#N/A"}},{"$f":"IF(VLOOKUP($E$17&$F20,'GW VOCs Table'!$A$9:$CG$5001,R$4,FALSE)>0,VLOOKUP($E$17&$F20,'GW VOCs Table'!$A$9:$CG$5001,R$4,FALSE),#N/A)","v":{"$error":"#N/A"}},{"$f":"IF(VLOOKUP($E$18&$F20,'GW VOCs Table'!$A$9:$CG$5001,S$4,FALSE)>0,VLOOKUP($E$18&$F20,'GW VOCs Table'!$A$9:$CG$5001,S$4,FALSE),#N/A)","v":{"$error":"#N/A"}},{"$f":"IF(VLOOKUP($E$19&$F20,'GW VOCs Table'!$A$9:$CG$5001,T$4,FALSE)>0,VLOOKUP($E$19&$F20,'GW VOCs Table'!$A$9:$CG$5001,T$4,FALSE),#N/A)","v":{"$error":"#N/A"}},{"$f":"IF(VLOOKUP($E$20&$F20,'GW VOCs Table'!$A$9:$CG$5001,U$4,FALSE)>0,VLOOKUP($E$20&$F20,'GW VOCs Table'!$A$9:$CG$5001,U$4,FALSE),#N/A)","v":{"$error":"#N/A"}},{"$f":"IF(VLOOKUP($E$21&$F20,'GW VOCs Table'!$A$9:$CG$5001,V$4,FALSE)>0,VLOOKUP($E$21&$F20,'GW VOCs Table'!$A$9:$CG$5001,V$4,FALSE),#N/A)","v":{"$error":"#N/A"}}]
[null,10,"2012-03-01","End","MW-16","2015-06-18",{"$f":"IF(VLOOKUP($E$6&$F21,'GW VOCs Table'!$A$9:$CG$5001,G$4,FALSE)>0,VLOOKUP($E$6&$F21,'GW VOCs Table'!$A$9:$CG$5001,G$4,FALSE),#N/A)","v":{"$error":"#N/A"}},{"$f":"IF(VLOOKUP($E$7&$F21,'GW VOCs Table'!$A$9:$CG$5001,H$4,FALSE)>0,VLOOKUP($E$7&$F21,'GW VOCs Table'!$A$9:$CG$5001,H$4,FALSE),#N/A)","v":{"$error":"#N/A"}},{"$f":"IF(VLOOKUP($E$8&$F21,'GW VOCs Table'!$A$9:$CG$5001,I$4,FALSE)>0,VLOOKUP($E$8&$F21,'GW VOCs Table'!$A$9:$CG$5001,I$4,FALSE),#N/A)","v":{"$error":"#N/A"}},{"$f":"IF(VLOOKUP($E$9&$F21,'GW VOCs Table'!$A$9:$CG$5001,J$4,FALSE)>0,VLOOKUP($E$9&$F21,'GW VOCs Table'!$A$9:$CG$5001,J$4,FALSE),#N/A)","v":{"$error":"#N/A"}},{"$f":"IF(VLOOKUP($E$10&$F21,'GW VOCs Table'!$A$9:$CG$5001,K$4,FALSE)>0,VLOOKUP($E$10&$F21,'GW VOCs Table'!$A$9:$CG$5001,K$4,FALSE),#N/A)","v":{"$error":"#N/A"}},{"$f":"IF(VLOOKUP($E$11&$F21,'GW VOCs Table'!$A$9:$CG$5001,L$4,FALSE)>0,VLOOKUP($E$11&$F21,'GW VOCs Table'!$A$9:$CG$5001,L$4,FALSE),#N/A)","v":{"$error":"#N/A"}},{"$f":"IF(VLOOKUP($E$12&$F21,'GW VOCs Table'!$A$9:$CG$5001,M$4,FALSE)>0,VLOOKUP($E$12&$F21,'GW VOCs Table'!$A$9:$CG$5001,M$4,FALSE),#N/A)","v":{"$error":"#N/A"}},{"$f":"IF(VLOOKUP($E$13&$F21,'GW VOCs Table'!$A$9:$CG$5001,N$4,FALSE)>0,VLOOKUP($E$13&$F21,'GW VOCs Table'!$A$9:$CG$5001,N$4,FALSE),#N/A)","v":{"$error":"#N/A"}},{"$f":"IF(VLOOKUP($E$14&$F21,'GW VOCs Table'!$A$9:$CG$5001,O$4,FALSE)>0,VLOOKUP($E$14&$F21,'GW VOCs Table'!$A$9:$CG$5001,O$4,FALSE),#N/A)","v":{"$error":"#N/A"}},{"$f":"IF(VLOOKUP($E$15&$F21,'GW VOCs Table'!$A$9:$CG$5001,P$4,FALSE)>0,VLOOKUP($E$15&$F21,'GW VOCs Table'!$A$9:$CG$5001,P$4,FALSE),#N/A)","v":{"$error":"#N/A"}},{"$f":"IF(VLOOKUP($E$16&$F21,'GW VOCs Table'!$A$9:$CG$5001,Q$4,FALSE)>0,VLOOKUP($E$16&$F21,'GW VOCs Table'!$A$9:$CG$5001,Q$4,FALSE),#N/A)","v":{"$error":"#N/A"}},{"$f":"IF(VLOOKUP($E$17&$F21,'GW VOCs Table'!$A$9:$CG$5001,R$4,FALSE)>0,VLOOKUP($E$17&$F21,'GW VOCs Table'!$A$9:$CG$5001,R$4,FALSE),#N/A)","v":{"$error":"#N/A"}},{"$f":"IF(VLOOKUP($E$18&$F21,'GW VOCs Table'!$A$9:$CG$5001,S$4,FALSE)>0,VLOOKUP($E$18&$F21,'GW VOCs Table'!$A$9:$CG$5001,S$4,FALSE),#N/A)","v":{"$error":"#N/A"}},{"$f":"IF(VLOOKUP($E$19&$F21,'GW VOCs Table'!$A$9:$CG$5001,T$4,FALSE)>0,VLOOKUP($E$19&$F21,'GW VOCs Table'!$A$9:$CG$5001,T$4,FALSE),#N/A)","v":{"$error":"#N/A"}},{"$f":"IF(VLOOKUP($E$20&$F21,'GW VOCs Table'!$A$9:$CG$5001,U$4,FALSE)>0,VLOOKUP($E$20&$F21,'GW VOCs Table'!$A$9:$CG$5001,U$4,FALSE),#N/A)","v":{"$error":"#N/A"}},{"$f":"IF(VLOOKUP($E$21&$F21,'GW VOCs Table'!$A$9:$CG$5001,V$4,FALSE)>0,VLOOKUP($E$21&$F21,'GW VOCs Table'!$A$9:$CG$5001,V$4,FALSE),#N/A)","v":{"$error":"#N/A"}}]
["In-situ Treatment Event 4",10,"2016-01-01","Start","MW-17","2015-12-17",{"$f":"IF(VLOOKUP($E$6&$F22,'GW VOCs Table'!$A$9:$CG$5001,G$4,FALSE)>0,VLOOKUP($E$6&$F22,'GW VOCs Table'!$A$9:$CG$5001,G$4,FALSE),#N/A)","v":{"$error":"#N/A"}},{"$f":"IF(VLOOKUP($E$7&$F22,'GW VOCs Table'!$A$9:$CG$5001,H$4,FALSE)>0,VLOOKUP($E$7&$F22,'GW VOCs Table'!$A$9:$CG$5001,H$4,FALSE),#N/A)","v":{"$error":"#N/A"}},{"$f":"IF(VLOOKUP($E$8&$F22,'GW VOCs Table'!$A$9:$CG$5001,I$4,FALSE)>0,VLOOKUP($E$8&$F22,'GW VOCs Table'!$A$9:$CG$5001,I$4,FALSE),#N/A)","v":{"$error":"#N/A"}},{"$f":"IF(VLOOKUP($E$9&$F22,'GW VOCs Table'!$A$9:$CG$5001,J$4,FALSE)>0,VLOOKUP($E$9&$F22,'GW VOCs Table'!$A$9:$CG$5001,J$4,FALSE),#N/A)","v":{"$error":"#N/A"}},{"$f":"IF(VLOOKUP($E$10&$F22,'GW VOCs Table'!$A$9:$CG$5001,K$4,FALSE)>0,VLOOKUP($E$10&$F22,'GW VOCs Table'!$A$9:$CG$5001,K$4,FALSE),#N/A)","v":{"$error":"#N/A"}},{"$f":"IF(VLOOKUP($E$11&$F22,'GW VOCs Table'!$A$9:$CG$5001,L$4,FALSE)>0,VLOOKUP($E$11&$F22,'GW VOCs Table'!$A$9:$CG$5001,L$4,FALSE),#N/A)","v":{"$error":"#N/A"}},{"$f":"IF(VLOOKUP($E$12&$F22,'GW VOCs Table'!$A$9:$CG$5001,M$4,FALSE)>0,VLOOKUP($E$12&$F22,'GW VOCs Table'!$A$9:$CG$5001,M$4,FALSE),#N/A)","v":{"$error":"#N/A"}},{"$f":"IF(VLOOKUP($E$13&$F22,'GW VOCs Table'!$A$9:$CG$5001,N$4,FALSE)>0,VLOOKUP($E$13&$F22,'GW VOCs Table'!$A$9:$CG$5001,N$4,FALSE),#N/A)","v":{"$error":"#N/A"}},{"$f":"IF(VLOOKUP($E$14&$F22,'GW VOCs Table'!$A$9:$CG$5001,O$4,FALSE)>0,VLOOKUP($E$14&$F22,'GW VOCs Table'!$A$9:$CG$5001,O$4,FALSE),#N/A)","v":{"$error":"#N/A"}},{"$f":"IF(VLOOKUP($E$15&$F22,'GW VOCs Table'!$A$9:$CG$5001,P$4,FALSE)>0,VLOOKUP($E$15&$F22,'GW VOCs Table'!$A$9:$CG$5001,P$4,FALSE),#N/A)","v":{"$error":"#N/A"}},{"$f":"IF(VLOOKUP($E$16&$F22,'GW VOCs Table'!$A$9:$CG$5001,Q$4,FALSE)>0,VLOOKUP($E$16&$F22,'GW VOCs Table'!$A$9:$CG$5001,Q$4,FALSE),#N/A)","v":{"$error":"#N/A"}},{"$f":"IF(VLOOKUP($E$17&$F22,'GW VOCs Table'!$A$9:$CG$5001,R$4,FALSE)>0,VLOOKUP($E$17&$F22,'GW VOCs Table'!$A$9:$CG$5001,R$4,FALSE),#N/A)","v":{"$error":"#N/A"}},{"$f":"IF(VLOOKUP($E$18&$F22,'GW VOCs Table'!$A$9:$CG$5001,S$4,FALSE)>0,VLOOKUP($E$18&$F22,'GW VOCs Table'!$A$9:$CG$5001,S$4,FALSE),#N/A)","v":{"$error":"#N/A"}},{"$f":"IF(VLOOKUP($E$19&$F22,'GW VOCs Table'!$A$9:$CG$5001,T$4,FALSE)>0,VLOOKUP($E$19&$F22,'GW VOCs Table'!$A$9:$CG$5001,T$4,FALSE),#N/A)","v":{"$error":"#N/A"}},{"$f":"IF(VLOOKUP($E$20&$F22,'GW VOCs Table'!$A$9:$CG$5001,U$4,FALSE)>0,VLOOKUP($E$20&$F22,'GW VOCs Table'!$A$9:$CG$5001,U$4,FALSE),#N/A)","v":{"$error":"#N/A"}},{"$f":"IF(VLOOKUP($E$21&$F22,'GW VOCs Table'!$A$9:$CG$5001,V$4,FALSE)>0,VLOOKUP($E$21&$F22,'GW VOCs Table'!$A$9:$CG$5001,V$4,FALSE),#N/A)","v":{"$error":"#N/A"}}]
[null,10,"2020-01-01","End","MW-18","2016-06-29",{"$f":"IF(VLOOKUP($E$6&$F23,'GW VOCs Table'!$A$9:$CG$5001,G$4,FALSE)>0,VLOOKUP($E$6&$F23,'GW VOCs Table'!$A$9:$CG$5001,G$4,FALSE),#N/A)","v":{"$error":"#N/A"}},{"$f":"IF(VLOOKUP($E$7&$F23,'GW VOCs Table'!$A$9:$CG$5001,H$4,FALSE)>0,VLOOKUP($E$7&$F23,'GW VOCs Table'!$A$9:$CG$5001,H$4,FALSE),#N/A)","v":{"$error":"#N/A"}},{"$f":"IF(VLOOKUP($E$8&$F23,'GW VOCs Table'!$A$9:$CG$5001,I$4,FALSE)>0,VLOOKUP($E$8&$F23,'GW VOCs Table'!$A$9:$CG$5001,I$4,FALSE),#N/A)","v":{"$error":"#N/A"}},{"$f":"IF(VLOOKUP($E$9&$F23,'GW VOCs Table'!$A$9:$CG$5001,J$4,FALSE)>0,VLOOKUP($E$9&$F23,'GW VOCs Table'!$A$9:$CG$5001,J$4,FALSE),#N/A)","v":{"$error":"#N/A"}},{"$f":"IF(VLOOKUP($E$10&$F23,'GW VOCs Table'!$A$9:$CG$5001,K$4,FALSE)>0,VLOOKUP($E$10&$F23,'GW VOCs Table'!$A$9:$CG$5001,K$4,FALSE),#N/A)","v":{"$error":"#N/A"}},{"$f":"IF(VLOOKUP($E$11&$F23,'GW VOCs Table'!$A$9:$CG$5001,L$4,FALSE)>0,VLOOKUP($E$11&$F23,'GW VOCs Table'!$A$9:$CG$5001,L$4,FALSE),#N/A)","v":{"$error":"#N/A"}},{"$f":"IF(VLOOKUP($E$12&$F23,'GW VOCs Table'!$A$9:$CG$5001,M$4,FALSE)>0,VLOOKUP($E$12&$F23,'GW VOCs Table'!$A$9:$CG$5001,M$4,FALSE),#N/A)","v":{"$error":"#N/A"}},{"$f":"IF(VLOOKUP($E$13&$F23,'GW VOCs Table'!$A$9:$CG$5001,N$4,FALSE)>0,VLOOKUP($E$13&$F23,'GW VOCs Table'!$A$9:$CG$5001,N$4,FALSE),#N/A)","v":{"$error":"#N/A"}},{"$f":"IF(VLOOKUP($E$14&$F23,'GW VOCs Table'!$A$9:$CG$5001,O$4,FALSE)>0,VLOOKUP($E$14&$F23,'GW VOCs Table'!$A$9:$CG$5001,O$4,FALSE),#N/A)","v":{"$error":"#N/A"}},{"$f":"IF(VLOOKUP($E$15&$F23,'GW VOCs Table'!$A$9:$CG$5001,P$4,FALSE)>0,VLOOKUP($E$15&$F23,'GW VOCs Table'!$A$9:$CG$5001,P$4,FALSE),#N/A)","v":{"$error":"#N/A"}},{"$f":"IF(VLOOKUP($E$16&$F23,'GW VOCs Table'!$A$9:$CG$5001,Q$4,FALSE)>0,VLOOKUP($E$16&$F23,'GW VOCs Table'!$A$9:$CG$5001,Q$4,FALSE),#N/A)","v":{"$error":"#N/A"}},{"$f":"IF(VLOOKUP($E$17&$F23,'GW VOCs Table'!$A$9:$CG$5001,R$4,FALSE)>0,VLOOKUP($E$17&$F23,'GW VOCs Table'!$A$9:$CG$5001,R$4,FALSE),#N/A)","v":{"$error":"#N/A"}},{"$f":"IF(VLOOKUP($E$18&$F23,'GW VOCs Table'!$A$9:$CG$5001,S$4,FALSE)>0,VLOOKUP($E$18&$F23,'GW VOCs Table'!$A$9:$CG$5001,S$4,FALSE),#N/A)","v":{"$error":"#N/A"}},{"$f":"IF(VLOOKUP($E$19&$F23,'GW VOCs Table'!$A$9:$CG$5001,T$4,FALSE)>0,VLOOKUP($E$19&$F23,'GW VOCs Table'!$A$9:$CG$5001,T$4,FALSE),#N/A)","v":{"$error":"#N/A"}},{"$f":"IF(VLOOKUP($E$20&$F23,'GW VOCs Table'!$A$9:$CG$5001,U$4,FALSE)>0,VLOOKUP($E$20&$F23,'GW VOCs Table'!$A$9:$CG$5001,U$4,FALSE),#N/A)","v":{"$error":"#N/A"}},{"$f":"IF(VLOOKUP($E$21&$F23,'GW VOCs Table'!$A$9:$CG$5001,V$4,FALSE)>0,VLOOKUP($E$21&$F23,'GW VOCs Table'!$A$9:$CG$5001,V$4,FALSE),#N/A)","v":{"$error":"#N/A"}}]
["In-situ Treatment Event 5",10,"2020-03-01","Start",null,"2017-04-12",{"$f":"IF(VLOOKUP($E$6&$F24,'GW VOCs Table'!$A$9:$CG$5001,G$4,FALSE)>0,VLOOKUP($E$6&$F24,'GW VOCs Table'!$A$9:$CG$5001,G$4,FALSE),#N/A)","v":{"$error":"#N/A"}},{"$f":"IF(VLOOKUP($E$7&$F24,'GW VOCs Table'!$A$9:$CG$5001,H$4,FALSE)>0,VLOOKUP($E$7&$F24,'GW VOCs Table'!$A$9:$CG$5001,H$4,FALSE),#N/A)","v":{"$error":"#N/A"}},{"$f":"IF(VLOOKUP($E$8&$F24,'GW VOCs Table'!$A$9:$CG$5001,I$4,FALSE)>0,VLOOKUP($E$8&$F24,'GW VOCs Table'!$A$9:$CG$5001,I$4,FALSE),#N/A)","v":{"$error":"#N/A"}},{"$f":"IF(VLOOKUP($E$9&$F24,'GW VOCs Table'!$A$9:$CG$5001,J$4,FALSE)>0,VLOOKUP($E$9&$F24,'GW VOCs Table'!$A$9:$CG$5001,J$4,FALSE),#N/A)","v":{"$error":"#N/A"}},{"$f":"IF(VLOOKUP($E$10&$F24,'GW VOCs Table'!$A$9:$CG$5001,K$4,FALSE)>0,VLOOKUP($E$10&$F24,'GW VOCs Table'!$A$9:$CG$5001,K$4,FALSE),#N/A)","v":{"$error":"#N/A"}},{"$f":"IF(VLOOKUP($E$11&$F24,'GW VOCs Table'!$A$9:$CG$5001,L$4,FALSE)>0,VLOOKUP($E$11&$F24,'GW VOCs Table'!$A$9:$CG$5001,L$4,FALSE),#N/A)","v":{"$error":"#N/A"}},{"$f":"IF(VLOOKUP($E$12&$F24,'GW VOCs Table'!$A$9:$CG$5001,M$4,FALSE)>0,VLOOKUP($E$12&$F24,'GW VOCs Table'!$A$9:$CG$5001,M$4,FALSE),#N/A)","v":{"$error":"#N/A"}},{"$f":"IF(VLOOKUP($E$13&$F24,'GW VOCs Table'!$A$9:$CG$5001,N$4,FALSE)>0,VLOOKUP($E$13&$F24,'GW VOCs Table'!$A$9:$CG$5001,N$4,FALSE),#N/A)","v":{"$error":"#N/A"}},{"$f":"IF(VLOOKUP($E$14&$F24,'GW VOCs Table'!$A$9:$CG$5001,O$4,FALSE)>0,VLOOKUP($E$14&$F24,'GW VOCs Table'!$A$9:$CG$5001,O$4,FALSE),#N/A)","v":{"$error":"#N/A"}},{"$f":"IF(VLOOKUP($E$15&$F24,'GW VOCs Table'!$A$9:$CG$5001,P$4,FALSE)>0,VLOOKUP($E$15&$F24,'GW VOCs Table'!$A$9:$CG$5001,P$4,FALSE),#N/A)","v":{"$error":"#N/A"}},{"$f":"IF(VLOOKUP($E$16&$F24,'GW VOCs Table'!$A$9:$CG$5001,Q$4,FALSE)>0,VLOOKUP($E$16&$F24,'GW VOCs Table'!$A$9:$CG$5001,Q$4,FALSE),#N/A)","v":{"$error":"#N/A"}},{"$f":"IF(VLOOKUP($E$17&$F24,'GW VOCs Table'!$A$9:$CG$5001,R$4,FALSE)>0,VLOOKUP($E$17&$F24,'GW VOCs Table'!$A$9:$CG$5001,R$4,FALSE),#N/A)","v":{"$error":"#N/A"}},{"$f":"IF(VLOOKUP($E$18&$F24,'GW VOCs Table'!$A$9:$CG$5001,S$4,FALSE)>0,VLOOKUP($E$18&$F24,'GW VOCs Table'!$A$9:$CG$5001,S$4,FALSE),#N/A)","v":{"$error":"#N/A"}},{"$f":"IF(VLOOKUP($E$19&$F24,'GW VOCs Table'!$A$9:$CG$5001,T$4,FALSE)>0,VLOOKUP($E$19&$F24,'GW VOCs Table'!$A$9:$CG$5001,T$4,FALSE),#N/A)","v":{"$error":"#N/A"}},{"$f":"IF(VLOOKUP($E$20&$F24,'GW VOCs Table'!$A$9:$CG$5001,U$4,FALSE)>0,VLOOKUP($E$20&$F24,'GW VOCs Table'!$A$9:$CG$5001,U$4,FALSE),#N/A)","v":{"$error":"#N/A"}},{"$f":"IF(VLOOKUP($E$21&$F24,'GW VOCs Table'!$A$9:$CG$5001,V$4,FALSE)>0,VLOOKUP($E$21&$F24,'GW VOCs Table'!$A$9:$CG$5001,V$4,FALSE),#N/A)","v":{"$error":"#N/A"}}]
[null,10,{"$f":"TODAY()","v":"2022-09-22"},"End",null,"2018-04-24",{"$f":"IF(VLOOKUP($E$6&$F25,'GW VOCs Table'!$A$9:$CG$5001,G$4,FALSE)>0,VLOOKUP($E$6&$F25,'GW VOCs Table'!$A$9:$CG$5001,G$4,FALSE),#N/A)","v":{"$error":"#N/A"}},{"$f":"IF(VLOOKUP($E$7&$F25,'GW VOCs Table'!$A$9:$CG$5001,H$4,FALSE)>0,VLOOKUP($E$7&$F25,'GW VOCs Table'!$A$9:$CG$5001,H$4,FALSE),#N/A)","v":{"$error":"#N/A"}},{"$f":"IF(VLOOKUP($E$8&$F25,'GW VOCs Table'!$A$9:$CG$5001,I$4,FALSE)>0,VLOOKUP($E$8&$F25,'GW VOCs Table'!$A$9:$CG$5001,I$4,FALSE),#N/A)","v":{"$error":"#N/A"}},{"$f":"IF(VLOOKUP($E$9&$F25,'GW VOCs Table'!$A$9:$CG$5001,J$4,FALSE)>0,VLOOKUP($E$9&$F25,'GW VOCs Table'!$A$9:$CG$5001,J$4,FALSE),#N/A)","v":{"$error":"#N/A"}},{"$f":"IF(VLOOKUP($E$10&$F25,'GW VOCs Table'!$A$9:$CG$5001,K$4,FALSE)>0,VLOOKUP($E$10&$F25,'GW VOCs Table'!$A$9:$CG$5001,K$4,FALSE),#N/A)","v":{"$error":"#N/A"}},{"$f":"IF(VLOOKUP($E$11&$F25,'GW VOCs Table'!$A$9:$CG$5001,L$4,FALSE)>0,VLOOKUP($E$11&$F25,'GW VOCs Table'!$A$9:$CG$5001,L$4,FALSE),#N/A)","v":{"$error":"#N/A"}},{"$f":"IF(VLOOKUP($E$12&$F25,'GW VOCs Table'!$A$9:$CG$5001,M$4,FALSE)>0,VLOOKUP($E$12&$F25,'GW VOCs Table'!$A$9:$CG$5001,M$4,FALSE),#N/A)","v":{"$error":"#N/A"}},{"$f":"IF(VLOOKUP($E$13&$F25,'GW VOCs Table'!$A$9:$CG$5001,N$4,FALSE)>0,VLOOKUP($E$13&$F25,'GW VOCs Table'!$A$9:$CG$5001,N$4,FALSE),#N/A)","v":{"$error":"#N/A"}},{"$f":"IF(VLOOKUP($E$14&$F25,'GW VOCs Table'!$A$9:$CG$5001,O$4,FALSE)>0,VLOOKUP($E$14&$F25,'GW VOCs Table'!$A$9:$CG$5001,O$4,FALSE),#N/A)","v":{"$error":"#N/A"}},{"$f":"IF(VLOOKUP($E$15&$F25,'GW VOCs Table'!$A$9:$CG$5001,P$4,FALSE)>0,VLOOKUP($E$15&$F25,'GW VOCs Table'!$A$9:$CG$5001,P$4,FALSE),#N/A)","v":{"$error":"#N/A"}},{"$f":"IF(VLOOKUP($E$16&$F25,'GW VOCs Table'!$A$9:$CG$5001,Q$4,FALSE)>0,VLOOKUP($E$16&$F25,'GW VOCs Table'!$A$9:$CG$5001,Q$4,FALSE),#N/A)","v":{"$error":"#N/A"}},{"$f":"IF(VLOOKUP($E$17&$F25,'GW VOCs Table'!$A$9:$CG$5001,R$4,FALSE)>0,VLOOKUP($E$17&$F25,'GW VOCs Table'!$A$9:$CG$5001,R$4,FALSE),#N/A)","v":{"$error":"#N/A"}},{"$f":"IF(VLOOKUP($E$18&$F25,'GW VOCs Table'!$A$9:$CG$5001,S$4,FALSE)>0,VLOOKUP($E$18&$F25,'GW VOCs Table'!$A$9:$CG$5001,S$4,FALSE),#N/A)","v":{"$error":"#N/A"}},{"$f":"IF(VLOOKUP($E$19&$F25,'GW VOCs Table'!$A$9:$CG$5001,T$4,FALSE)>0,VLOOKUP($E$19&$F25,'GW VOCs Table'!$A$9:$CG$5001,T$4,FALSE),#N/A)","v":{"$error":"#N/A"}},{"$f":"IF(VLOOKUP($E$20&$F25,'GW VOCs Table'!$A$9:$CG$5001,U$4,FALSE)>0,VLOOKUP($E$20&$F25,'GW VOCs Table'!$A$9:$CG$5001,U$4,FALSE),#N/A)","v":{"$error":"#N/A"}},{"$f":"IF(VLOOKUP($E$21&$F25,'GW VOCs Table'!$A$9:$CG$5001,V$4,FALSE)>0,VLOOKUP($E$21&$F25,'GW VOCs Table'!$A$9:$CG$5001,V$4,FALSE),#N/A)","v":{"$error":"#N/A"}}]
[null,null,null,null,null,"2018-10-11",{"$f":"IF(VLOOKUP($E$6&$F26,'GW VOCs Table'!$A$9:$CG$5001,G$4,FALSE)>0,VLOOKUP($E$6&$F26,'GW VOCs Table'!$A$9:$CG$5001,G$4,FALSE),#N/A)","v":{"$error":"#N/A"}},{"$f":"IF(VLOOKUP($E$7&$F26,'GW VOCs Table'!$A$9:$CG$5001,H$4,FALSE)>0,VLOOKUP($E$7&$F26,'GW VOCs Table'!$A$9:$CG$5001,H$4,FALSE),#N/A)","v":{"$error":"#N/A"}},{"$f":"IF(VLOOKUP($E$8&$F26,'GW VOCs Table'!$A$9:$CG$5001,I$4,FALSE)>0,VLOOKUP($E$8&$F26,'GW VOCs Table'!$A$9:$CG$5001,I$4,FALSE),#N/A)","v":{"$error":"#N/A"}},{"$f":"IF(VLOOKUP($E$9&$F26,'GW VOCs Table'!$A$9:$CG$5001,J$4,FALSE)>0,VLOOKUP($E$9&$F26,'GW VOCs Table'!$A$9:$CG$5001,J$4,FALSE),#N/A)","v":{"$error":"#N/A"}},{"$f":"IF(VLOOKUP($E$10&$F26,'GW VOCs Table'!$A$9:$CG$5001,K$4,FALSE)>0,VLOOKUP($E$10&$F26,'GW VOCs Table'!$A$9:$CG$5001,K$4,FALSE),#N/A)","v":{"$error":"#N/A"}},{"$f":"IF(VLOOKUP($E$11&$F26,'GW VOCs Table'!$A$9:$CG$5001,L$4,FALSE)>0,VLOOKUP($E$11&$F26,'GW VOCs Table'!$A$9:$CG$5001,L$4,FALSE),#N/A)","v":{"$error":"#N/A"}},{"$f":"IF(VLOOKUP($E$12&$F26,'GW VOCs Table'!$A$9:$CG$5001,M$4,FALSE)>0,VLOOKUP($E$12&$F26,'GW VOCs Table'!$A$9:$CG$5001,M$4,FALSE),#N/A)","v":{"$error":"#N/A"}},{"$f":"IF(VLOOKUP($E$13&$F26,'GW VOCs Table'!$A$9:$CG$5001,N$4,FALSE)>0,VLOOKUP($E$13&$F26,'GW VOCs Table'!$A$9:$CG$5001,N$4,FALSE),#N/A)","v":{"$error":"#N/A"}},{"$f":"IF(VLOOKUP($E$14&$F26,'GW VOCs Table'!$A$9:$CG$5001,O$4,FALSE)>0,VLOOKUP($E$14&$F26,'GW VOCs Table'!$A$9:$CG$5001,O$4,FALSE),#N/A)","v":{"$error":"#N/A"}},{"$f":"IF(VLOOKUP($E$15&$F26,'GW VOCs Table'!$A$9:$CG$5001,P$4,FALSE)>0,VLOOKUP($E$15&$F26,'GW VOCs Table'!$A$9:$CG$5001,P$4,FALSE),#N/A)","v":{"$error":"#N/A"}},{"$f":"IF(VLOOKUP($E$16&$F26,'GW VOCs Table'!$A$9:$CG$5001,Q$4,FALSE)>0,VLOOKUP($E$16&$F26,'GW VOCs Table'!$A$9:$CG$5001,Q$4,FALSE),#N/A)","v":{"$error":"#N/A"}},{"$f":"IF(VLOOKUP($E$17&$F26,'GW VOCs Table'!$A$9:$CG$5001,R$4,FALSE)>0,VLOOKUP($E$17&$F26,'GW VOCs Table'!$A$9:$CG$5001,R$4,FALSE),#N/A)","v":{"$error":"#N/A"}},{"$f":"IF(VLOOKUP($E$18&$F26,'GW VOCs Table'!$A$9:$CG$5001,S$4,FALSE)>0,VLOOKUP($E$18&$F26,'GW VOCs Table'!$A$9:$CG$5001,S$4,FALSE),#N/A)","v":{"$error":"#N/A"}},{"$f":"IF(VLOOKUP($E$19&$F26,'GW VOCs Table'!$A$9:$CG$5001,T$4,FALSE)>0,VLOOKUP($E$19&$F26,'GW VOCs Table'!$A$9:$CG$5001,T$4,FALSE),#N/A)","v":{"$error":"#N/A"}},{"$f":"IF(VLOOKUP($E$20&$F26,'GW VOCs Table'!$A$9:$CG$5001,U$4,FALSE)>0,VLOOKUP($E$20&$F26,'GW VOCs Table'!$A$9:$CG$5001,U$4,FALSE),#N/A)","v":{"$error":"#N/A"}},{"$f":"IF(VLOOKUP($E$21&$F26,'GW VOCs Table'!$A$9:$CG$5001,V$4,FALSE)>0,VLOOKUP($E$21&$F26,'GW VOCs Table'!$A$9:$CG$5001,V$4,FALSE),#N/A)","v":{"$error":"#N/A"}}]
[null,null,null,null,null,"2019-04-02",{"$f":"IF(VLOOKUP($E$6&$F27,'GW VOCs Table'!$A$9:$CG$5001,G$4,FALSE)>0,VLOOKUP($E$6&$F27,'GW VOCs Table'!$A$9:$CG$5001,G$4,FALSE),#N/A)","v":{"$error":"#N/A"}},{"$f":"IF(VLOOKUP($E$7&$F27,'GW VOCs Table'!$A$9:$CG$5001,H$4,FALSE)>0,VLOOKUP($E$7&$F27,'GW VOCs Table'!$A$9:$CG$5001,H$4,FALSE),#N/A)","v":{"$error":"#N/A"}},{"$f":"IF(VLOOKUP($E$8&$F27,'GW VOCs Table'!$A$9:$CG$5001,I$4,FALSE)>0,VLOOKUP($E$8&$F27,'GW VOCs Table'!$A$9:$CG$5001,I$4,FALSE),#N/A)","v":{"$error":"#N/A"}},{"$f":"IF(VLOOKUP($E$9&$F27,'GW VOCs Table'!$A$9:$CG$5001,J$4,FALSE)>0,VLOOKUP($E$9&$F27,'GW VOCs Table'!$A$9:$CG$5001,J$4,FALSE),#N/A)","v":{"$error":"#N/A"}},{"$f":"IF(VLOOKUP($E$10&$F27,'GW VOCs Table'!$A$9:$CG$5001,K$4,FALSE)>0,VLOOKUP($E$10&$F27,'GW VOCs Table'!$A$9:$CG$5001,K$4,FALSE),#N/A)","v":{"$error":"#N/A"}},{"$f":"IF(VLOOKUP($E$11&$F27,'GW VOCs Table'!$A$9:$CG$5001,L$4,FALSE)>0,VLOOKUP($E$11&$F27,'GW VOCs Table'!$A$9:$CG$5001,L$4,FALSE),#N/A)","v":{"$error":"#N/A"}},{"$f":"IF(VLOOKUP($E$12&$F27,'GW VOCs Table'!$A$9:$CG$5001,M$4,FALSE)>0,VLOOKUP($E$12&$F27,'GW VOCs Table'!$A$9:$CG$5001,M$4,FALSE),#N/A)","v":{"$error":"#N/A"}},{"$f":"IF(VLOOKUP($E$13&$F27,'GW VOCs Table'!$A$9:$CG$5001,N$4,FALSE)>0,VLOOKUP($E$13&$F27,'GW VOCs Table'!$A$9:$CG$5001,N$4,FALSE),#N/A)","v":{"$error":"#N/A"}},{"$f":"IF(VLOOKUP($E$14&$F27,'GW VOCs Table'!$A$9:$CG$5001,O$4,FALSE)>0,VLOOKUP($E$14&$F27,'GW VOCs Table'!$A$9:$CG$5001,O$4,FALSE),#N/A)","v":{"$error":"#N/A"}},{"$f":"IF(VLOOKUP($E$15&$F27,'GW VOCs Table'!$A$9:$CG$5001,P$4,FALSE)>0,VLOOKUP($E$15&$F27,'GW VOCs Table'!$A$9:$CG$5001,P$4,FALSE),#N/A)","v":{"$error":"#N/A"}},{"$f":"IF(VLOOKUP($E$16&$F27,'GW VOCs Table'!$A$9:$CG$5001,Q$4,FALSE)>0,VLOOKUP($E$16&$F27,'GW VOCs Table'!$A$9:$CG$5001,Q$4,FALSE),#N/A)","v":{"$error":"#N/A"}},{"$f":"IF(VLOOKUP($E$17&$F27,'GW VOCs Table'!$A$9:$CG$5001,R$4,FALSE)>0,VLOOKUP($E$17&$F27,'GW VOCs Table'!$A$9:$CG$5001,R$4,FALSE),#N/A)","v":{"$error":"#N/A"}},{"$f":"IF(VLOOKUP($E$18&$F27,'GW VOCs Table'!$A$9:$CG$5001,S$4,FALSE)>0,VLOOKUP($E$18&$F27,'GW VOCs Table'!$A$9:$CG$5001,S$4,FALSE),#N/A)","v":{"$error":"#N/A"}},{"$f":"IF(VLOOKUP($E$19&$F27,'GW VOCs Table'!$A$9:$CG$5001,T$4,FALSE)>0,VLOOKUP($E$19&$F27,'GW VOCs Table'!$A$9:$CG$5001,T$4,FALSE),#N/A)","v":{"$error":"#N/A"}},{"$f":"IF(VLOOKUP($E$20&$F27,'GW VOCs Table'!$A$9:$CG$5001,U$4,FALSE)>0,VLOOKUP($E$20&$F27,'GW VOCs Table'!$A$9:$CG$5001,U$4,FALSE),#N/A)","v":{"$error":"#N/A"}},{"$f":"IF(VLOOKUP($E$21&$F27,'GW VOCs Table'!$A$9:$CG$5001,V$4,FALSE)>0,VLOOKUP($E$21&$F27,'GW VOCs Table'!$A$9:$CG$5001,V$4,FALSE),#N/A)","v":{"$error":"#N/A"}}]
[null,null,null,null,null,"2019-08-15",{"$f":"IF(VLOOKUP($E$6&$F28,'GW VOCs Table'!$A$9:$CG$5001,G$4,FALSE)>0,VLOOKUP($E$6&$F28,'GW VOCs Table'!$A$9:$CG$5001,G$4,FALSE),#N/A)","v":{"$error":"#N/A"}},{"$f":"IF(VLOOKUP($E$7&$F28,'GW VOCs Table'!$A$9:$CG$5001,H$4,FALSE)>0,VLOOKUP($E$7&$F28,'GW VOCs Table'!$A$9:$CG$5001,H$4,FALSE),#N/A)","v":{"$error":"#N/A"}},{"$f":"IF(VLOOKUP($E$8&$F28,'GW VOCs Table'!$A$9:$CG$5001,I$4,FALSE)>0,VLOOKUP($E$8&$F28,'GW VOCs Table'!$A$9:$CG$5001,I$4,FALSE),#N/A)","v":{"$error":"#N/A"}},{"$f":"IF(VLOOKUP($E$9&$F28,'GW VOCs Table'!$A$9:$CG$5001,J$4,FALSE)>0,VLOOKUP($E$9&$F28,'GW VOCs Table'!$A$9:$CG$5001,J$4,FALSE),#N/A)","v":{"$error":"#N/A"}},{"$f":"IF(VLOOKUP($E$10&$F28,'GW VOCs Table'!$A$9:$CG$5001,K$4,FALSE)>0,VLOOKUP($E$10&$F28,'GW VOCs Table'!$A$9:$CG$5001,K$4,FALSE),#N/A)","v":{"$error":"#N/A"}},{"$f":"IF(VLOOKUP($E$11&$F28,'GW VOCs Table'!$A$9:$CG$5001,L$4,FALSE)>0,VLOOKUP($E$11&$F28,'GW VOCs Table'!$A$9:$CG$5001,L$4,FALSE),#N/A)","v":{"$error":"#N/A"}},{"$f":"IF(VLOOKUP($E$12&$F28,'GW VOCs Table'!$A$9:$CG$5001,M$4,FALSE)>0,VLOOKUP($E$12&$F28,'GW VOCs Table'!$A$9:$CG$5001,M$4,FALSE),#N/A)","v":{"$error":"#N/A"}},{"$f":"IF(VLOOKUP($E$13&$F28,'GW VOCs Table'!$A$9:$CG$5001,N$4,FALSE)>0,VLOOKUP($E$13&$F28,'GW VOCs Table'!$A$9:$CG$5001,N$4,FALSE),#N/A)","v":{"$error":"#N/A"}},{"$f":"IF(VLOOKUP($E$14&$F28,'GW VOCs Table'!$A$9:$CG$5001,O$4,FALSE)>0,VLOOKUP($E$14&$F28,'GW VOCs Table'!$A$9:$CG$5001,O$4,FALSE),#N/A)","v":{"$error":"#N/A"}},{"$f":"IF(VLOOKUP($E$15&$F28,'GW VOCs Table'!$A$9:$CG$5001,P$4,FALSE)>0,VLOOKUP($E$15&$F28,'GW VOCs Table'!$A$9:$CG$5001,P$4,FALSE),#N/A)","v":{"$error":"#N/A"}},{"$f":"IF(VLOOKUP($E$16&$F28,'GW VOCs Table'!$A$9:$CG$5001,Q$4,FALSE)>0,VLOOKUP($E$16&$F28,'GW VOCs Table'!$A$9:$CG$5001,Q$4,FALSE),#N/A)","v":{"$error":"#N/A"}},{"$f":"IF(VLOOKUP($E$17&$F28,'GW VOCs Table'!$A$9:$CG$5001,R$4,FALSE)>0,VLOOKUP($E$17&$F28,'GW VOCs Table'!$A$9:$CG$5001,R$4,FALSE),#N/A)","v":{"$error":"#N/A"}},{"$f":"IF(VLOOKUP($E$18&$F28,'GW VOCs Table'!$A$9:$CG$5001,S$4,FALSE)>0,VLOOKUP($E$18&$F28,'GW VOCs Table'!$A$9:$CG$5001,S$4,FALSE),#N/A)","v":{"$error":"#N/A"}},{"$f":"IF(VLOOKUP($E$19&$F28,'GW VOCs Table'!$A$9:$CG$5001,T$4,FALSE)>0,VLOOKUP($E$19&$F28,'GW VOCs Table'!$A$9:$CG$5001,T$4,FALSE),#N/A)","v":{"$error":"#N/A"}},{"$f":"IF(VLOOKUP($E$20&$F28,'GW VOCs Table'!$A$9:$CG$5001,U$4,FALSE)>0,VLOOKUP($E$20&$F28,'GW VOCs Table'!$A$9:$CG$5001,U$4,FALSE),#N/A)","v":{"$error":"#N/A"}},{"$f":"IF(VLOOKUP($E$21&$F28,'GW VOCs Table'!$A$9:$CG$5001,V$4,FALSE)>0,VLOOKUP($E$21&$F28,'GW VOCs Table'!$A$9:$CG$5001,V$4,FALSE),#N/A)","v":{"$error":"#N/A"}}]
[null,null,null,null,null,"2019-11-19",{"$f":"IF(VLOOKUP($E$6&$F29,'GW VOCs Table'!$A$9:$CG$5001,G$4,FALSE)>0,VLOOKUP($E$6&$F29,'GW VOCs Table'!$A$9:$CG$5001,G$4,FALSE),#N/A)","v":{"$error":"#N/A"}},{"$f":"IF(VLOOKUP($E$7&$F29,'GW VOCs Table'!$A$9:$CG$5001,H$4,FALSE)>0,VLOOKUP($E$7&$F29,'GW VOCs Table'!$A$9:$CG$5001,H$4,FALSE),#N/A)","v":{"$error":"#N/A"}},{"$f":"IF(VLOOKUP($E$8&$F29,'GW VOCs Table'!$A$9:$CG$5001,I$4,FALSE)>0,VLOOKUP($E$8&$F29,'GW VOCs Table'!$A$9:$CG$5001,I$4,FALSE),#N/A)","v":{"$error":"#N/A"}},{"$f":"IF(VLOOKUP($E$9&$F29,'GW VOCs Table'!$A$9:$CG$5001,J$4,FALSE)>0,VLOOKUP($E$9&$F29,'GW VOCs Table'!$A$9:$CG$5001,J$4,FALSE),#N/A)","v":{"$error":"#N/A"}},{"$f":"IF(VLOOKUP($E$10&$F29,'GW VOCs Table'!$A$9:$CG$5001,K$4,FALSE)>0,VLOOKUP($E$10&$F29,'GW VOCs Table'!$A$9:$CG$5001,K$4,FALSE),#N/A)","v":{"$error":"#N/A"}},{"$f":"IF(VLOOKUP($E$11&$F29,'GW VOCs Table'!$A$9:$CG$5001,L$4,FALSE)>0,VLOOKUP($E$11&$F29,'GW VOCs Table'!$A$9:$CG$5001,L$4,FALSE),#N/A)","v":{"$error":"#N/A"}},{"$f":"IF(VLOOKUP($E$12&$F29,'GW VOCs Table'!$A$9:$CG$5001,M$4,FALSE)>0,VLOOKUP($E$12&$F29,'GW VOCs Table'!$A$9:$CG$5001,M$4,FALSE),#N/A)","v":{"$error":"#N/A"}},{"$f":"IF(VLOOKUP($E$13&$F29,'GW VOCs Table'!$A$9:$CG$5001,N$4,FALSE)>0,VLOOKUP($E$13&$F29,'GW VOCs Table'!$A$9:$CG$5001,N$4,FALSE),#N/A)","v":{"$error":"#N/A"}},{"$f":"IF(VLOOKUP($E$14&$F29,'GW VOCs Table'!$A$9:$CG$5001,O$4,FALSE)>0,VLOOKUP($E$14&$F29,'GW VOCs Table'!$A$9:$CG$5001,O$4,FALSE),#N/A)","v":{"$error":"#N/A"}},{"$f":"IF(VLOOKUP($E$15&$F29,'GW VOCs Table'!$A$9:$CG$5001,P$4,FALSE)>0,VLOOKUP($E$15&$F29,'GW VOCs Table'!$A$9:$CG$5001,P$4,FALSE),#N/A)","v":{"$error":"#N/A"}},{"$f":"IF(VLOOKUP($E$16&$F29,'GW VOCs Table'!$A$9:$CG$5001,Q$4,FALSE)>0,VLOOKUP($E$16&$F29,'GW VOCs Table'!$A$9:$CG$5001,Q$4,FALSE),#N/A)","v":{"$error":"#N/A"}},{"$f":"IF(VLOOKUP($E$17&$F29,'GW VOCs Table'!$A$9:$CG$5001,R$4,FALSE)>0,VLOOKUP($E$17&$F29,'GW VOCs Table'!$A$9:$CG$5001,R$4,FALSE),#N/A)","v":{"$error":"#N/A"}},{"$f":"IF(VLOOKUP($E$18&$F29,'GW VOCs Table'!$A$9:$CG$5001,S$4,FALSE)>0,VLOOKUP($E$18&$F29,'GW VOCs Table'!$A$9:$CG$5001,S$4,FALSE),#N/A)","v":{"$error":"#N/A"}},{"$f":"IF(VLOOKUP($E$19&$F29,'GW VOCs Table'!$A$9:$CG$5001,T$4,FALSE)>0,VLOOKUP($E$19&$F29,'GW VOCs Table'!$A$9:$CG$5001,T$4,FALSE),#N/A)","v":{"$error":"#N/A"}},{"$f":"IF(VLOOKUP($E$20&$F29,'GW VOCs Table'!$A$9:$CG$5001,U$4,FALSE)>0,VLOOKUP($E$20&$F29,'GW VOCs Table'!$A$9:$CG$5001,U$4,FALSE),#N/A)","v":{"$error":"#N/A"}},{"$f":"IF(VLOOKUP($E$21&$F29,'GW VOCs Table'!$A$9:$CG$5001,V$4,FALSE)>0,VLOOKUP($E$21&$F29,'GW VOCs Table'!$A$9:$CG$5001,V$4,FALSE),#N/A)","v":{"$error":"#N/A"}}]
[null,null,null,null,null,"2020-03-12",{"$f":"IF(VLOOKUP($E$6&$F30,'GW VOCs Table'!$A$9:$CG$5001,G$4,FALSE)>0,VLOOKUP($E$6&$F30,'GW VOCs Table'!$A$9:$CG$5001,G$4,FALSE),#N/A)","v":{"$error":"#N/A"}},{"$f":"IF(VLOOKUP($E$7&$F30,'GW VOCs Table'!$A$9:$CG$5001,H$4,FALSE)>0,VLOOKUP($E$7&$F30,'GW VOCs Table'!$A$9:$CG$5001,H$4,FALSE),#N/A)","v":{"$error":"#N/A"}},{"$f":"IF(VLOOKUP($E$8&$F30,'GW VOCs Table'!$A$9:$CG$5001,I$4,FALSE)>0,VLOOKUP($E$8&$F30,'GW VOCs Table'!$A$9:$CG$5001,I$4,FALSE),#N/A)","v":{"$error":"#N/A"}},{"$f":"IF(VLOOKUP($E$9&$F30,'GW VOCs Table'!$A$9:$CG$5001,J$4,FALSE)>0,VLOOKUP($E$9&$F30,'GW VOCs Table'!$A$9:$CG$5001,J$4,FALSE),#N/A)","v":{"$error":"#N/A"}},{"$f":"IF(VLOOKUP($E$10&$F30,'GW VOCs Table'!$A$9:$CG$5001,K$4,FALSE)>0,VLOOKUP($E$10&$F30,'GW VOCs Table'!$A$9:$CG$5001,K$4,FALSE),#N/A)","v":{"$error":"#N/A"}},{"$f":"IF(VLOOKUP($E$11&$F30,'GW VOCs Table'!$A$9:$CG$5001,L$4,FALSE)>0,VLOOKUP($E$11&$F30,'GW VOCs Table'!$A$9:$CG$5001,L$4,FALSE),#N/A)","v":{"$error":"#N/A"}},{"$f":"IF(VLOOKUP($E$12&$F30,'GW VOCs Table'!$A$9:$CG$5001,M$4,FALSE)>0,VLOOKUP($E$12&$F30,'GW VOCs Table'!$A$9:$CG$5001,M$4,FALSE),#N/A)","v":{"$error":"#N/A"}},{"$f":"IF(VLOOKUP($E$13&$F30,'GW VOCs Table'!$A$9:$CG$5001,N$4,FALSE)>0,VLOOKUP($E$13&$F30,'GW VOCs Table'!$A$9:$CG$5001,N$4,FALSE),#N/A)","v":{"$error":"#N/A"}},{"$f":"IF(VLOOKUP($E$14&$F30,'GW VOCs Table'!$A$9:$CG$5001,O$4,FALSE)>0,VLOOKUP($E$14&$F30,'GW VOCs Table'!$A$9:$CG$5001,O$4,FALSE),#N/A)","v":{"$error":"#N/A"}},{"$f":"IF(VLOOKUP($E$15&$F30,'GW VOCs Table'!$A$9:$CG$5001,P$4,FALSE)>0,VLOOKUP($E$15&$F30,'GW VOCs Table'!$A$9:$CG$5001,P$4,FALSE),#N/A)","v":{"$error":"#N/A"}},{"$f":"IF(VLOOKUP($E$16&$F30,'GW VOCs Table'!$A$9:$CG$5001,Q$4,FALSE)>0,VLOOKUP($E$16&$F30,'GW VOCs Table'!$A$9:$CG$5001,Q$4,FALSE),#N/A)","v":{"$error":"#N/A"}},{"$f":"IF(VLOOKUP($E$17&$F30,'GW VOCs Table'!$A$9:$CG$5001,R$4,FALSE)>0,VLOOKUP($E$17&$F30,'GW VOCs Table'!$A$9:$CG$5001,R$4,FALSE),#N/A)","v":{"$error":"#N/A"}},{"$f":"IF(VLOOKUP($E$18&$F30,'GW VOCs Table'!$A$9:$CG$5001,S$4,FALSE)>0,VLOOKUP($E$18&$F30,'GW VOCs Table'!$A$9:$CG$5001,S$4,FALSE),#N/A)","v":{"$error":"#N/A"}},{"$f":"IF(VLOOKUP($E$19&$F30,'GW VOCs Table'!$A$9:$CG$5001,T$4,FALSE)>0,VLOOKUP($E$19&$F30,'GW VOCs Table'!$A$9:$CG$5001,T$4,FALSE),#N/A)","v":{"$error":"#N/A"}},{"$f":"IF(VLOOKUP($E$20&$F30,'GW VOCs Table'!$A$9:$CG$5001,U$4,FALSE)>0,VLOOKUP($E$20&$F30,'GW VOCs Table'!$A$9:$CG$5001,U$4,FALSE),#N/A)","v":{"$error":"#N/A"}},{"$f":"IF(VLOOKUP($E$21&$F30,'GW VOCs Table'!$A$9:$CG$5001,V$4,FALSE)>0,VLOOKUP($E$21&$F30,'GW VOCs Table'!$A$9:$CG$5001,V$4,FALSE),#N/A)","v":{"$error":"#N/A"}}]
[null,null,null,null,null,"2020-06-04",{"$f":"IF(VLOOKUP($E$6&$F31,'GW VOCs Table'!$A$9:$CG$5001,G$4,FALSE)>0,VLOOKUP($E$6&$F31,'GW VOCs Table'!$A$9:$CG$5001,G$4,FALSE),#N/A)","v":{"$error":"#N/A"}},{"$f":"IF(VLOOKUP($E$7&$F31,'GW VOCs Table'!$A$9:$CG$5001,H$4,FALSE)>0,VLOOKUP($E$7&$F31,'GW VOCs Table'!$A$9:$CG$5001,H$4,FALSE),#N/A)","v":{"$error":"#N/A"}},{"$f":"IF(VLOOKUP($E$8&$F31,'GW VOCs Table'!$A$9:$CG$5001,I$4,FALSE)>0,VLOOKUP($E$8&$F31,'GW VOCs Table'!$A$9:$CG$5001,I$4,FALSE),#N/A)","v":{"$error":"#N/A"}},{"$f":"IF(VLOOKUP($E$9&$F31,'GW VOCs Table'!$A$9:$CG$5001,J$4,FALSE)>0,VLOOKUP($E$9&$F31,'GW VOCs Table'!$A$9:$CG$5001,J$4,FALSE),#N/A)","v":{"$error":"#N/A"}},{"$f":"IF(VLOOKUP($E$10&$F31,'GW VOCs Table'!$A$9:$CG$5001,K$4,FALSE)>0,VLOOKUP($E$10&$F31,'GW VOCs Table'!$A$9:$CG$5001,K$4,FALSE),#N/A)","v":{"$error":"#N/A"}},{"$f":"IF(VLOOKUP($E$11&$F31,'GW VOCs Table'!$A$9:$CG$5001,L$4,FALSE)>0,VLOOKUP($E$11&$F31,'GW VOCs Table'!$A$9:$CG$5001,L$4,FALSE),#N/A)","v":{"$error":"#N/A"}},{"$f":"IF(VLOOKUP($E$12&$F31,'GW VOCs Table'!$A$9:$CG$5001,M$4,FALSE)>0,VLOOKUP($E$12&$F31,'GW VOCs Table'!$A$9:$CG$5001,M$4,FALSE),#N/A)","v":{"$error":"#N/A"}},{"$f":"IF(VLOOKUP($E$13&$F31,'GW VOCs Table'!$A$9:$CG$5001,N$4,FALSE)>0,VLOOKUP($E$13&$F31,'GW VOCs Table'!$A$9:$CG$5001,N$4,FALSE),#N/A)","v":{"$error":"#N/A"}},{"$f":"IF(VLOOKUP($E$14&$F31,'GW VOCs Table'!$A$9:$CG$5001,O$4,FALSE)>0,VLOOKUP($E$14&$F31,'GW VOCs Table'!$A$9:$CG$5001,O$4,FALSE),#N/A)","v":{"$error":"#N/A"}},{"$f":"IF(VLOOKUP($E$15&$F31,'GW VOCs Table'!$A$9:$CG$5001,P$4,FALSE)>0,VLOOKUP($E$15&$F31,'GW VOCs Table'!$A$9:$CG$5001,P$4,FALSE),#N/A)","v":{"$error":"#N/A"}},{"$f":"IF(VLOOKUP($E$16&$F31,'GW VOCs Table'!$A$9:$CG$5001,Q$4,FALSE)>0,VLOOKUP($E$16&$F31,'GW VOCs Table'!$A$9:$CG$5001,Q$4,FALSE),#N/A)","v":{"$error":"#N/A"}},{"$f":"IF(VLOOKUP($E$17&$F31,'GW VOCs Table'!$A$9:$CG$5001,R$4,FALSE)>0,VLOOKUP($E$17&$F31,'GW VOCs Table'!$A$9:$CG$5001,R$4,FALSE),#N/A)","v":{"$error":"#N/A"}},{"$f":"IF(VLOOKUP($E$18&$F31,'GW VOCs Table'!$A$9:$CG$5001,S$4,FALSE)>0,VLOOKUP($E$18&$F31,'GW VOCs Table'!$A$9:$CG$5001,S$4,FALSE),#N/A)","v":{"$error":"#N/A"}},{"$f":"IF(VLOOKUP($E$19&$F31,'GW VOCs Table'!$A$9:$CG$5001,T$4,FALSE)>0,VLOOKUP($E$19&$F31,'GW VOCs Table'!$A$9:$CG$5001,T$4,FALSE),#N/A)","v":{"$error":"#N/A"}},{"$f":"IF(VLOOKUP($E$20&$F31,'GW VOCs Table'!$A$9:$CG$5001,U$4,FALSE)>0,VLOOKUP($E$20&$F31,'GW VOCs Table'!$A$9:$CG$5001,U$4,FALSE),#N/A)","v":{"$error":"#N/A"}},{"$f":"IF(VLOOKUP($E$21&$F31,'GW VOCs Table'!$A$9:$CG$5001,V$4,FALSE)>0,VLOOKUP($E$21&$F31,'GW VOCs Table'!$A$9:$CG$5001,V$4,FALSE),#N/A)","v":{"$error":"#N/A"}}]

{"sheet":"Free Product Recovery Table","index":13,"n_rows":98,"n_cols":37,"rows_kept":98,"cut":false,"hidden":false,"merged":[[0,0,0,11]]}
["Free Product Recovery Table"]
["Well ID","Well Diameter","Date","Removal Method","Explain if \"Other\" Removal Method (240 character limit)","Start Date","End Date","Beginning Free Product Thickness (ft)","Ending Free Product Thickness (ft)","Product Extracted per Period (gals)","Cumulative Total Product Extracted (gals)","Comments/O&M Notes",null,null,null,null,null,null,null,null,null,null,null,null,null,null,null,null,null,null,null,null,null,null,null,null,{"$f":"AJ2+AK1","v":0}]
[null,null,null,null,null,null,null,null,null,null,null,null,null,"Insert rows between the last line of data and the last line of the table. Highlight the number of rows needed, right-click, go to insert."]
[null,null,null,null,null,null,null,null,null,null,null,null,null,"DO NOT ctrl-V when pasting data into the table, right-click and PASTE VALUES"]
[]
[]
[]
[]
[]
[]
[]
[]
[]
[]
[]
[]
[]
[]
[]
[]
[]
[]
[]
[]
[]
[]
[]
[]
[]
[]
[]
[]
[]
[]
[]
[]
[]
[]
[]
[]
[]
[]
[]
[]
[]
[]
[]
[]
[]
[null,null,null,null,null,null,null,null,null,null,null,null,null,"END OF FIRST PAGE BREAK"]
[]
[]
[]
[]
[]
[]
[]
[]
[]
[]
[]
[]
[]
[]
[]
[]
[]
[]
[]
[]
[]
[]
[]
[]
[]
[]
[]
[]
[]
[]
[]
[]
[]
[]
[]
[]
[]
[]
[]
[]
[]
[]
[]
[]
[]
[]
[]
[null,null,null,null,null,null,null,null,null,null,null,null,null,"END OF SECOND PAGE BREAK"]

{"sheet":"Excavation Detail Table","index":14,"n_rows":4,"n_cols":34,"rows_kept":4,"cut":false,"hidden":false,"merged":[[0,0,0,11]]}
["Excavation Detail Table",null,null,null,null,null,null,null,null,null,null,null,null,null,null,null,null,null,null,null,null,null,null,null,null,null,null,null,null,null,null,null,null,{"$f":"AF1-AG1","v":0}]
["Excavation Location","Excavation Completion Date","Average Depth of Excavation (ft)","Surface Area of Excavation (sq. ft.)","Total Volume of Excavated Soil\n(bank ydsᶟ)","Volume of Non-impacted Excavated Soil used as backfill (bank ydsᶟ)","Volume of Excavated Soil Disposed (bank ydsᶟ)","Weight of Excavated Soil Disposed (tons)","Disposal Method of Excavated Soil","Was Groundwater Present in the Excavation?","Sample Location & Sample Name","Comments"]
[null,null,null,null,null,null,null,null,null,null,null,null,null,"Insert rows between the last line of data and the last line of the table. Highlight the number of rows needed, right-click, go to insert."]
[null,null,null,null,null,null,null,null,null,null,null,null,null,"DO NOT ctrl-V when pasting data into the table, right-click and PASTE VALUES"]

{"sheet":"Air Sparge Soil Vapor Extractio","index":15,"n_rows":52,"n_cols":79,"rows_kept":52,"cut":false,"hidden":false,"merged":[[2,0,3,0],[2,1,3,1]]}
["Soil Vapor Survey Results Table",null,null,null,null,null,null,null,null,null,null,null,null,null,null,null,null,null,null,null,null,null,null,null,null,null,null,null,null,null,null,null,null,null,null,null,null,null,null,null,null,null,null,null,null,null,null,null,null,null,null,null,null,null,null,null,null,null,null,null,null,null,null,null,null,null,null,null,null,null,null,null,null,null,null,null,null,null,"Insert rows between the last line of data and the last line of the table. Highlight the number of rows needed, right-click, go to insert."]
["Notes: ","If a result is less than the detection limit, input \"<\" followed by the detection limit. If the compound does not have a laboratory detection or laboratory limit (example: some labs may not have a detection/reporting limit for certain TICs), then input “ND”. If a compound is not analyzed, input \"NA\".",null,null,null,null,null,null,null,null,null,null,null,null,null,null,null,null,null,null,null,null,null,null,null,null,null,null,null,null,null,null,null,null,null,null,null,null,null,null,null,null,null,null,null,null,null,null,null,null,null,null,null,null,null,null,null,null,null,null,null,null,null,null,null,null,null,null,null,null,null,null,null,null,null,null,null,null,"DO NOT ctrl-V when pasting data into the table, right-click and PASTE VALUES"]
["Sample ID","Sample Date"]
[null,null,"PID (if applicable)","Ethanol","Acetone","Acrolein","Acrylonitrile","Benzene","Bromobenzene","Bromodichloromethane","Bromoform","Bromomethane","1,3-Butadiene","n-Butylbenzene","sec-Butylbenzene","tert-Butylbenzene","Carbon Tetrachloride","Carbon disulfide","Chlorobenzene","Chlorodibromomethane","Chloroethane","Chloroform","Chloromethane","Cyclohexane","2-Chlorotoluene","4-Chlorotoluene","1,2-Dibromo-3-Chloropropane","1,2-Dibromoethane (EDB)","Dibromomethane","1,2-Dichlorobenzene","1,3-Dichlorobenzene","1,4-Dichlorobenzene","Dichlorodifluoromethane","1,1-Dichloroethane","1,2-Dichloroethane (1,2-DCA)","1,1-Dichloroethene","cis-1,2-Dichloroethene","trans-1,2-Dichloroethene","1,2-Dichloropropane","1,1-Dichloropropene","1,3-Dichloropropane","cis-1,3-Dichloropropene","trans-1,3-Dichloropropene","2,2-Dichloropropane","Dicyclopentadiene","Di-isopropyl ether","Ethylbenzene","4-Ethyltoluene","Hexachloro-1,3-butadiene","n-Hexane","Isopropylbenzene (cumene)","p-Isopropyltoluene (cymene)","2-Butanone (MEK)","Methyl Cyclohexane","Methylene Chloride","4-Methyl-2-pentanone (MIBK)","Methyl tert-butyl ether (MTBE)","Naphthalene","Propene","n-Propylbenzene","Styrene","1,1,1,2-Tetrachloroethane","1,1,2,2-Tetrachloroethane","1,1,2-Trichlorotrifluoroethane","Tetrachloroethene","Toluene","1,2,3-Trichlorobenzene","1,2,4-Trichlorobenzene","1,1,1-Trichloroethane","1,1,2-Trichloroethane","Trichloroethene","Trichlorofluoromethane","1,2,3-Trichloropropane","1,2,4-Trimethylbenzene","1,2,3-Trimethylbenzene","1,3,5-Trimethylbenzene","Vinyl chloride","Xylenes, total"]
["CAS Numbers",null,null,"64-17-5","67-64-1","107-02-8","107-13-1","71-43-2","108-86-1","75-27-4","75-25-2","74-83-9","106-99-0","104-51-8","135-98-8","98-06-6","56-23-5","75-15-0","108-90-7","124-48-1","75-00-3","67-66-3","74-87-3","110-82-7","95-49-8","106-43-4","96-12-8","106-93-4","74-95-3","95-50-1","541-73-1","106-46-7","75-71-8","75-34-3","107-06-2","75-35-4","156-59-2","156-60-5","78-87-5","563-58-6","142-28-9","10061-01-5","10061-02-6","594-20-7","77-73-6","108-20-3","100-41-4","622-96-8","87-68-3","110-54-3","98-82-8","99-87-6","78-93-3","108-87-2","75-09-2","108-10-1","1634-04-4","91-20-3","115-07-1","103-65-1","100-42-5","630-20-6","79-34-5","76-13-1","127-18-4","108-88-3","87-61-6","120-82-1","71-55-6","79-00-5","79-01-6","75-69-4","96-18-4","95-63-6","526-73-8","108-67-8","75-01-4","1330-20-7"]
[null,null,null,{"$f":"IFERROR(_xlfn.IFS(SUM(D7:D4999)>0,\"\",COUNTIF(D7:D4999,\"*\"&\" \"&\"*\"),\"\"),\"X\")","v":"X"},"X","X","X","X","X","X","X","X","X","X","X","X","X","X","X","X","X","X","X","X","X","X","X","X","X","X","X","X","X","X","X","X","X","X","X","X","X","X","X","X","X","X","X","X","X","X","X","X","X","X","X","X","X","X","X","X","X","X","X","X","X","X","X",{"$f":"IFERROR(_xlfn.IFS(SUM(BP7:BP4999)>0,\"\",COUNTIF(BP7:BP4999,\"*\"&\" \"&\"*\"),\"\"),\"X\")","v":"X"},"X","X","X","X","X","X","X","X","X","X"]
[]
[]
[]
[]
[]
[]
[]
[]
[]
[]
[]
[]
[]
[]
[]
[]
[]
[]
[]
[]
[]
[]
[]
[]
[]
[]
[]
[]
[]
[]
[]
[]
[]
[]
[]
[]
[]
[]
[]
[]
[]
[]
[]
[]
["Insert rows between the last line of data and the last line of the table. Highlight the number of rows needed, right-click, go to insert."]
["DO NOT ctrl-V when pasting data into the table, right-click and PASTE VALUES"]

{"sheet":"SVE Table","index":16,"n_rows":49,"n_cols":96,"rows_kept":49,"cut":false,"hidden":false,"merged":[[0,0,0,18],[46,1,46,12],[46,13,49,14],[44,0,44,1]]}
["SVE Table"]
["Date","Hour Clock Reading","Actual Operating Hours","Potential Period Hours","Percent Runtime","Pre-Dilution System Flow Rate (cfm)","Pre-Dilution PID Reading (ppm)","Pre-Dilution System Influent VOC (mg/m3)","Post-Dilution System Flow Rate\n(cfm)","Post-Dilution PID Reading (ppm)","Post-Dilution System Influent VOC (mg/m3)","System Display Flow Rate\n(cfm)","Effluent PID Reading\n(ppm)","Effluent VOC (mg/m3)","Destruction Efficiency (%)","VOC Removal Rate (lbs/day)","VOC Removed Per Period (lbs)","Cumulative VOCs Removed\n(lbs)","O&M Notes",null,null,null,null,null,null,null,null,null,null,null,null,null,null,null,null,null,null,null,null,null,null,null,null,null,null,null,null,null,null,null,null,null,null,null,null,null,null,null,null,null,null,null,null,null,null,null,{"$f":"BN2-BN1","v":0},{"$f":"BO2+BP1","v":0},{"$f":"(BM2-BM1)*24","v":0},{"$f":"BQ2+BR1","v":0},{"$f":"BO2/BQ2","v":{"$error":"#DIV/0!"}},{"$f":"BP2/BR2","v":{"$error":"#DIV/0!"}},null,null,null,{"$f":"#REF!","v":{"$error":"#REF!"}},{"$f":"PI()*((BX2/12)^2)*BW2","v":{"$error":"#REF!"}},null,null,null,null,null,null,null,null,null,{"$f":"#REF!","v":{"$error":"#REF!"}},{"$f":"PI()*(CI2/12)^2*CH2","v":{"$error":"#REF!"}},{"$f":"IF(CD2=\"N/A\",(CA2-CF2)/CA2,(CD2-CF2)/CD2)","v":{"$error":"#DIV/0!"}},null,{"$f":"CN2/(BM2-BM1)","v":{"$error":"#REF!"}},{"$f":"(1.56*10^(-7))*BY2*CA2*100*BO2","v":{"$error":"#REF!"}},{"$f":"CN2+CO1","v":{"$error":"#REF!"}},{"$f":"CQ2/(BM2-BM1)","v":{"$error":"#REF!"}},{"$f":"(1.56*10^(-7))*CJ2*CF2*100*BO2","v":{"$error":"#REF!"}},{"$f":"CQ2+CR1","v":{"$error":"#REF!"}}]
[]
[]
[]
[]
[]
[]
[]
[]
[]
[]
[]
[]
[]
[]
[]
[]
[]
[]
[]
[]
[]
[]
[]
[]
[]
[]
[]
[]
[]
[]
[]
[]
[]
[]
[]
[]
[]
[]
[]
[]
[]
[]
["Totals:",null,{"$f":"SUM(C3:C44)","v":0},{"$f":"SUM(D3:D44)","v":0},{"$f":"C45/D45","v":{"$error":"#DIV/0!"}},null,null,null,null,null,null,null,null,null,null,null,{"$f":"SUM(Q3:Q44)","v":0},null,null,null,"END OF PAGE BREAK"]
[]
[null,"PASTE VALUES OF MASS CALCULATIONS INTO THIS SPREADSHEET AND EMBED AN EXCEL VERSION OF YOUR MASS CALCLUATION TABLE AS BACKUP HERE -->"]
[null,"Insert rows between the last line of data and the last line of the table. Highlight the number of rows needed, right-click, go to insert. Drag formulas down."]
[null,"DO NOT ctrl-V when pasting data into the table, right-click and PASTE VALUES"]

{"sheet":"Detail SVE Table","index":17,"n_rows":112,"n_cols":80,"rows_kept":112,"cut":false,"hidden":false,"merged":[[0,0,0,8]]}
["Detail SVE Table",null,null,null,null,null,null,null,null,null,null,null,null,null,null,null,null,null,null,null,null,null,null,null,null,null,null,null,null,null,null,null,null,{"$f":"IF(AB1=$K$4,$L$4,IF(AB1=$K$5,$L$5,\"No Wells Installed\"))","v":"No Wells Installed"},{"$f":"IF(AH1=\"No Wells Installed\",\"No Wells Installed\",PI()*((AH1/12)^2)*AG1)","v":"No Wells Installed"},null,null,null,null,null,null,null,null,null,null,null,null,null,null,null,null,null,null,null,null,null,null,null,null,null,null,null,null,null,null,null,null,null,null,null,null,null,null,null,null,null,null,null,{"$f":"IF(AB1=$K$4,$L$4,IF(B3=$K$5,$L$5,\"No Wells Installed\"))","v":"No Wells Installed"},{"$f":"PI()*((CA1/12)^2)*BZ1","v":{"$error":"#VALUE!"}}]
["Date","Vapor Well ID","Status (Open/ Closed)","Oxygen (%)","VOC (ppm)","Vacuum (H2O\")","Velocity (fpm)","Well Radius (inches)","Flow (cfm)"]
[null,null,null,null,null,null,null,null,null,null,"Vapor Well ID","Well Radius (inches)",null,"Insert rows between the last line of data and the last line of the table. Highlight the number of rows needed, right-click, go to insert. Drag formulas down."]
[null,null,null,null,null,null,null,null,null,null,"Example1",null,null,"DO NOT ctrl-V when pasting data into the table, right-click and PASTE VALUES"]
[null,null,null,null,null,null,null,null,null,null,"Example2"]
[null,null,null,null,null,null,null,null,null,null,"Example3"]
[null,null,null,null,null,null,null,null,null,null,"Example4"]
[null,null,null,null,null,null,null,null,null,null,"Example5"]
[null,null,null,null,null,null,null,null,null,null,"Example6"]
[null,null,null,null,null,null,null,null,null,null,"Example7"]
[null,null,null,null,null,null,null,null,null,null,"Example8"]
[null,null,null,null,null,null,null,null,null,null,"Example9"]
[null,null,null,null,null,null,null,null,null,null,"Example10"]
[]
[]
[]
[]
[]
[]
[]
[]
[]
[]
[null,null,null,null,null,null,null,null,null,null,"END OF FIRST PAGE BREAK"]
[]
[]
[]
[]
[]
[]
[]
[]
[]
[]
[]
[]
[null,null,null,null,null,null,null,null,null,null,"END OF FIRST PAGE BREAK"]
[]
[]
[]
[]
[]
[]
[]
[]
[null,null,null,null,null,null,null,null,null,null,"END OF SECOND PAGE BREAK"]
[]
[]
[]
[]
[]
[]
[]
[]
[]
[]
[]
[]
[]
[]
[]
[]
[]
[]
[]
[]
[]
[null,null,null,null,null,null,null,null,null,null,"END OF THIRD PAGE BREAK"]
[]
[]
[]
[]
[]
[]
[]
[]
[]
[]
[]
[]
[]
[]
[]
[]
[]
[]
[]
[]
[]
[null,null,null,null,null,null,null,null,null,null,"END OF FOURTH PAGE BREAK"]
[]
[]
[]
[]
[]
[]
[]
[]
[]
[]
[]
[]
[]
[]
[]
[]
[]
[]
[]
[]
[]
[null,null,null,null,null,null,null,null,null,null,"END OF THIRD PAGE BREAK"]

{"sheet":"AS Table","index":18,"n_rows":68,"n_cols":34,"rows_kept":68,"cut":false,"hidden":false,"merged":[[0,0,0,11]]}
["Air Sparge System Data"]
["Date","Hour Clock Reading","Actual Operating Hours","Cumulative Actual Operating Hours","Potential Operating Hours","Cumulative Potential Operating Hours","Percent Runtime","Cumulative Percent Runtime","Cycle (minutes on/off)","Pressure (psi)","Flow Rate (cfm)","O&M Comments",null,null,null,null,null,null,null,null,null,null,null,null,null,null,null,null,{"$f":"AB2-AB1","v":0},{"$f":"AC2+AD1","v":0},{"$f":"(AA2-AA1)*24","v":0},{"$f":"AE2+AF1","v":0},{"$f":"AC2/AE2","v":{"$error":"#DIV/0!"}},{"$f":"AD2/AF2","v":{"$error":"#DIV/0!"}}]
[null,null,null,null,null,null,null,null,null,null,null,null,null,"Insert rows between the last line of data and the last line of the table. Highlight the number of rows needed, right-click, go to insert. Drag formulas down."]
[null,null,null,null,null,null,null,null,null,null,null,null,null,"DO NOT ctrl-V when pasting data into the table, right-click and PASTE VALUES"]
[]
[]
[]
[]
[]
[]
[]
[]
[]
[]
[]
[]
[]
[]
[]
[]
[]
[]
[]
[]
[]
[]
[]
[]
[]
[]
[]
[]
[]
[]
[null,null,null,null,null,null,null,null,null,null,null,null,null,"END OF FIRST PAGE BREAK"]
[]
[]
[]
[]
[]
[]
[]
[]
[]
[]
[]
[]
[]
[]
[]
[]
[]
[]
[]
[]
[]
[]
[]
[]
[]
[]
[]
[]
[]
[]
[]
[]
[null,null,null,null,null,null,null,null,null,null,null,null,null,"END OF SECOND PAGE BREAK"]

{"sheet":"Detail AS Table","index":19,"n_rows":6,"n_cols":10,"rows_kept":6,"cut":false,"hidden":false,"merged":[[0,0,0,5]]}
["Detail Air Sparge Data"]
["Date","Well ID","Well Status (Open/Closed)","Cycle\n(minutes on/off)","Pressure (psi)","Flow Rate (cfm)"]
[]
[]
[null,null,null,null,null,null,null,null,null,"Insert rows between the last line of data and the last line of the table. Highlight the number of rows needed, right-click, go to insert. Drag formulas down."]
[null,null,null,null,null,null,null,null,null,"DO NOT ctrl-V when pasting data into the table, right-click and PASTE VALUES"]

{"sheet":"DPE-P&T Table","index":20,"n_rows":62,"n_cols":71,"rows_kept":62,"cut":false,"hidden":false,"merged":[[61,1,61,15],[61,16,65,17],[56,0,56,1],[0,0,0,19],[1,19,2,19],[1,12,1,13],[1,14,1,18],[1,0,2,0],[1,10,1,11],[1,1,1,9]]}
["Dual Phase Extraction - Pump and Treat Data"]
["Date","System Performance",null,null,null,null,null,null,null,null,"Groundwater Sample Analysis",null,"Vapor Analysis",null,"Mass Removal",null,null,null,null,"O&M Comments",null,null,null,null,null,null,null,null,null,null,null,null,null,null,null,null,null,null,null,null,null,null,null,null,null,null,null,{"$f":"AU2-AU1","v":0},{"$f":"AV2+AW1","v":0},{"$f":"(AT2-AT1)*24","v":0},{"$f":"AX2+AY1","v":0},{"$f":"AV2/AX2","v":{"$error":"#DIV/0!"}},{"$f":"AW2/AY2","v":{"$error":"#DIV/0!"}},null,null,null,null,null,null,null,null,null,null,{"$f":"BF2*6","v":0},{"$f":"(1.56*10^(-7))*(BD2)*(BI2)*100*AV2","v":0},{"$f":"(1.56*10^(-7))*(BD2)*(BK2)*100*AV2","v":0},{"$f":"BE2*3.7853*(BG2-BH2)*(2.205/(10^6))","v":0},{"$f":"BL2+BM2+BO2","v":0},{"$f":"BN2+BL2+BO2","v":0},{"$f":"BP2+BR1","v":0},{"$f":"BQ2+BS1","v":0}]
[null,"Hour Clock Reading","Actual Operating Hours","Potential Operating Hours","Percent Runtime","Induced Vacuum (in Hg)","Effluent Temperature (°F)","System Air Flow Rate (scfm)","Total Fluid Recovered\n(gals)","Total LNAPL Recovered\n(gals)","VOC Influent  Concentration (mg/L)","VOC Effluent Concentration (mg/L)","VOCs Influent Concentration\n(mg/m3)","VOCs Effluent Concentration (mg/m3)","VOCs Removed from LNAPL (lbs)","VOCs Removed from Vapor\n(lbs)","VOCs Removed from Groundwater\n(lbs)","Combined VOCs Removed \n(lbs)","Cumulative VOCs Removed \n(lbs)"]
[]
[]
[]
[]
[]
[]
[]
[]
[]
[]
[]
[]
[]
[]
[]
[]
[]
[]
[]
[]
[]
[]
[]
[]
[]
[]
[]
[]
[]
[]
[]
[]
[]
[]
[]
[]
[]
[]
[]
[]
[]
[]
[]
[]
[]
[]
[]
[]
[]
[]
[]
[]
[]
["Cumulative Totals:",null,{"$f":"SUM(C4:C56)","v":0},{"$f":"SUM(D4:D56)","v":0},{"$f":"C57/D57","v":{"$error":"#DIV/0!"}},null,null,null,null,null,null,null,null,null,{"$f":"SUM(O4:O56)","v":0},{"$f":"SUM(P4:P56)","v":0},{"$f":"SUM(Q4:Q56)","v":0}]
[]
[]
[null,"Insert rows between the last line of data and the last line of the table. Highlight the number of rows needed, right-click, go to insert. Drag formulas down."]
[null,"DO NOT ctrl-V when pasting data into the table, right-click and PASTE VALUES"]
[null,"USER MAY OVERRIDE FORMULAS AND PASTE VALUES OF MASS CALCULATIONS INTO THIS SPREADSHEET AND EMBED AN EXCEL VERSION OF YOUR MASS CALCLUATION TABLE AS BACKUP HERE -->"]

{"sheet":"ISCO, AC, & Bio Injection","index":21,"n_rows":50,"n_cols":23,"rows_kept":50,"cut":false,"hidden":false,"merged":[[46,0,46,1],[1,0,2,0],[1,11,1,19],[1,1,1,10],[1,20,2,20]]}
["In Situ Chemical Oxidation and Injection Table"]
["Date","Liquid or Slurry Based Addition (Include Activated Carbon)",null,null,null,null,null,null,null,null,null,"Oxidant or Ozone Gas Addition",null,null,null,null,null,null,null,null,"O&M Comments"]
[null,"General Chemical Descriptions and Concentrations","Primary Chemical by Weight (lbs)","Secondary/ Catalyst Chemical by Weight (lbs)","Total Injectate Volume (gals)","Means of Application","Application Depth Range (ft)","Injection Pressure (psi) ","Number of Injection Points","Approximate Treatment Area (sq. ft.)","Approximate Treatment Thickness (ft)","Hour Clock Reading","Actual Operating Hours","Potential Operating Hours","Percent Runtime","Injection Method","Injection Pressure (psi)","Number of Injection Points","Volume of Oxygen Injected (cu. ft.)","Volume of Ozone Injected (lbs)"]
[null,null,null,null,null,null,null,null,null,null,null,null,null,null,null,null,null,null,null,null,null,null,"Insert rows between the last line of data and the last line of the table. Highlight the number of rows needed, right-click, go to insert. Drag formulas down."]
[null,null,null,null,null,null,null,null,null,null,null,null,null,null,null,null,null,null,null,null,null,null,"DO NOT ctrl-V when pasting data into the table, right-click and PASTE VALUES"]
[]
[]
[]
[]
[]
[]
[]
[]
[]
[]
[]
[]
[]
[]
[]
[]
[]
[]
[]
[]
[]
[]
[]
[]
[]
[]
[]
[]
[]
[]
[]
[]
[]
[]
[]
[]
[]
[]
[]
[]
[]
["Cumulative Totals:",null,{"$f":"SUM(C4:C46)","v":0},{"$f":"SUM(D4:D46)","v":0},{"$f":"SUM(E4:E46)","v":0},null,null,null,null,null,null,null,{"$f":"SUM(M4:M46)","v":0},{"$f":"SUM(N4:N46)","v":0},{"$f":"M47/N47","v":{"$error":"#DIV/0!"}},null,null,null,{"$f":"SUM(S4:S46)","v":0},{"$f":"SUM(T4:T46)","v":0}]
[]
[null,null,"Insert rows between the last line of data and the last line of the table. Highlight the number of rows needed, right-click, go to insert. Drag formulas down."]
[null,null,"DO NOT ctrl-V when pasting data into the table, right-click and PASTE VALUES"]

{"sheet":"CSM","index":22,"n_rows":47,"n_cols":21,"rows_kept":47,"cut":false,"hidden":false,"merged":[[8,18,8,20],[11,18,11,20],[12,18,12,20]]}
[null,null,null,null,null,null,"ADEQ Site Investigation Guidance Manual - October 2014"]
[null,null,null,null,null,null,"https://static.azdeq.gov/vrp/site_investigation_guidance.pdf"]
[]
[]
[]
[null,null,null,null,null,null,"CONCEPTUAL SITE MODEL EXAMPLE"]
[null,null,null,null,null,null,"Modify the below as appropriate for your Site"]
[]
[null,null,null,null,null,null,"Primary  Source",null,"Release Mechanism",null,"Secondary        Source",null,"Impacted Media",null,"Exposure Media",null,"Exposure Route",null,"Receptor"]
[]
[null,null,null,null,null,null,null,null,null,null,null,null,null,null,null,null,null,null,"Resident","Indoor Worker","Utility Worker"]
[null,null,null,null,null,null,null,null,null,null,null,null,null,null,null,null,null,null,"Exposure Potential"]
[null,null,null,null,null,null,null,null,null,null,null,null,null,null,null,null,null,null,"Exposure Route Status"]
[null,null,null,null,null,null,"UST System Component",null,"Leak and/or Spill",null,"LNAPL",null,"Soil",null,"Outdoor Air",null,"Inhalation",null,"Yes                 Incomplete","No                           Not Applicable","Yes                 Incomplete"]
[]
[null,null,null,null,null,null,null,null,null,null,null,null,null,null,null,null,"Ingestion",null,"No                           Not Applicable","No                           Not Applicable","No                           Not Applicable"]
[]
[null,null,null,null,null,null,null,null,null,null,null,null,null,null,null,null,"Dermal",null,"No                           Not Applicable","No                           Not Applicable","No                           Not Applicable"]
[]
[]
[null,null,null,null,null,null,null,null,null,null,null,null,"Groundwater",null,null,null,"Inhalation",null,"No                           Not Applicable","No                           Not Applicable","No                           Not Applicable"]
[]
[null,null,null,null,null,null,null,null,null,null,null,null,null,null,null,null,"Ingestion",null,"No                           Not Applicable","No                           Not Applicable","No                           Not Applicable"]
[]
[null,null,null,null,null,null,null,null,null,null,null,null,null,null,null,null,"Dermal",null,"No                           Not Applicable","No                           Not Applicable","No                           Not Applicable"]
[]
[]
[]
[]
[]
[]
[]
[]
[]
[]
[]
[]
[]
[]
[]
[]
[]
[]
[]
[]
[]
[null,null,"Pictorial CSM: As of 12/21/21"]

{"sheet":"Well Summary Table","index":23,"n_rows":101,"n_cols":21,"rows_kept":101,"cut":false,"hidden":false,"merged":[[0,0,0,18],[1,1,1,18]]}
["ADWR Well Summary Table (copy and paste ADWR data export for all wells within a quarter mile of plume)"]
["Date of data export"]
["REGISTRY_ID","GWSI_ SITE_ID","CADASTRAL","OWNER_ NAME","WELL_TYPE_GROUP","WELL_ DEPTH","CASING_ DEPTH","CASING_ DIAMETER","APPLICATION","INSTALLED","WATER_ LEVEL","PUMPRATE","RGR_PUMP_DATA","COMPLETION_ REPORT_STATUS","DRILL_LOG","UTM_X_ METERS","UTM_Y_ METERS","Not Threatened/Threatened/Impacted?","Explain"]
[]
[]
[]
[]
[]
[]
[]
[]
[]
[]
[]
[]
[]
[]
[]
[]
[]
[]
[]
[]
[]
[]
[]
[]
[]
[]
[]
[]
[]
[]
[]
[]
[]
[]
[]
[]
[]
[]
[]
[]
[]
[]
[]
[]
[]
[]
[]
[]
[null,null,null,null,null,null,null,null,null,null,null,null,null,null,null,null,null,null,null,null,"END OF FIRST PAGE BREAK"]
[]
[]
[]
[]
[]
[]
[]
[]
[]
[]
[]
[]
[]
[]
[]
[]
[]
[]
[]
[]
[]
[]
[]
[]
[]
[]
[]
[]
[]
[]
[]
[]
[]
[]
[]
[]
[]
[]
[]
[]
[]
[]
[]
[]
[]
[]
[]
[]
[null,null,null,null,null,null,null,null,null,null,null,null,null,null,null,null,null,null,null,null,"END OF SECOND PAGE BREAK"]

{"sheet":"Dropdown Options","index":24,"n_rows":18,"n_cols":49,"rows_kept":18,"cut":false,"hidden":true,"merged":[[11,33,11,34],[0,33,0,34],[1,33,1,34]]}
["Phase","Well Diameter (inches)","Removal Methods","Disposition of Excavated Soil","Well Type","Well Status","Media","Complete","LSCF","Lithology","Cause","Source","Not Threatened","Yes","Shallow Soil Contamination (0-15 ft)","Subsurface Soil Contamination (15+ ft)","Soil Vapor","Predominant Soil Type","Vadose Zone Moisture","Depth to Groundwater","Groundwater Contamination","Groundwater Contamination Location","Free Product Present","Surface Water Distance","Age of GW Analytical Data","Data Completeness/ Correct Analytical Data","Age of Release","Property Use","Onsite UST Status","Receptor  Description","Exposure Route","Means of Application","Closure Type","Closure Standard at Time of Closure Approval ",null,"Type of Surface Cover","Quality/Condition of Surface Cover","Tracer","Product Type","Location of Excavation","Injection Method","Age of Soil Analytical Data","USCS","Well Use","Direction from site","Program","Sample Type","Well Status","Select Analytes for Graph"]
["ISC",2,"Hand bail","Excavated and disposed off-site","Exempt","Dry","Surficial soil (less than and equal to 15 ft)","Potentially Complete",1,"Cobbles/gravel/sand","Corrosion","Tank","Threatened","No","No Contamination","<rSRL","Not Complete Pathway","Clays","High",">100 ft","<AWQS/Tier 1 or Not Applicable","None Present","None Present","None or >5 miles","<1 year or Not Applicable","8260B+TICs & PAHs & TEL (if release older than 1996)",">20 yrs","Vacant Land","None - All Removed or Closed-in-Place","School","Inhalation","Gravity Feed into Monitoring Well","Temporary","Soil",null,"Asphalt","Poor - Heavily degraded; Allows direct exposure to or from soils","<10","Gasoline","Former Tank Basin","Sparging","<2 years","GW","Irrigation","N","Open UST","Purge","O","Benzene"]
["SC",4,"Passive skimmer","Untreated and returned to excavation","Non-exempt","Destroyed","Subsurface soil ( >15 ft)","Incomplete",2,"Sand/silty sand mixture","Spill","Piping","Impacted",null,"<rSRL","rSRL - 10x rSRL","Data Fails Commercial Use","Silts","Medium","30-100 ft","AWQS/Tier 1 - 10x AWQS/Tier 1","On-Site Only","Occasional","2-5 miles","1-2 years","8260B (No TICs) & PAHs","10-20 yrs","Commercial","Not Active or Temporarily Closed","Day care","Dermal","Gravity Feed into Infiltration Gallery","In Place","SSCLs","Suggested Soil Cleanup Levels","Concrete","Moderate - Surface fractures that may allow exposure to or from soils","10-50","Diesel","Former Piping","Diffusion","2-6 years","GP","Commercial","E","Closed UST","Non-purge","C","Toluene"]
["TDI",null,"Pneumatic skimmer","Treated and returned to excavation",null,"Inaccessible","Groundwater",null,3,"Silty sand/sandy clay mixture","Overfill","Piping - Tank Joint","N/A",null,">rSRL",">10x rSRL - 100x rSRL","Data Fails Residential Use","Sands","Low","15-30 ft","10x-100x AWQS/Tier 1","Off-Site","Continuous","<2 miles","2-6 years","8260B (No TICs)","<10 yrs","Residential","Active - No Open Suspected Release(s)","Hospital","Ingestion","Pressure Injection into Formation","Removal","HBGLs","Health Based Guidance Levels","Asphalt/Concrete","Good - No exposure to or from soils","50-100",null,"Former Dispenser",null,"6-10 years","GM","Domestic","S","Open LUST",null,null,"Ethylbenzene"]
["O&M",null,"Absorbent sock",null,null,null,"Air",null,4,"Silty clay/clay mixture","Installation Problem","Piping - Piping Joint/Elbow/Connector",null,null,"No Data",">100x rSRL","No Data","No Data","No Data","<15 ft",">100x AWQS/Tier 1","Irr/Dom Well <500 ft","Off-Site Wells","On-Site","> 6 years","BTEX & MTBE Only",null,"School, daycare, hospital, nursing home, etc.","Active - Open Suspected Release(s)","Nursing home",null,"Pressure Injection into Dedicated Injection Well","N/A","rSRLs (1997)","residential Soil Remediation Levels (1997)","None","N/A - There is no surface cover",">100",null,null,null,">10 years","GC","Municipal","W","Closed LUST",null,null,"Total Xylenes"]
["CL",null,"Other",null,null,null,"Surface water",null,"N/A","Bedrock","Vehicle Damage","Dispenser Area",null,null,null,"No Data",null,null,null,"No Data","No Data","No Data","No Data",null,"No Data","No Data",null,null,null,"Other Residential (receptor present for 8+ hrs a day)",null,"Pressure Injection into Monitoring Well Without Packer",null,"nrSRLs (1997)","non-residential Soil Remediation Levels (1997)",null,null,null,null,null,null,"No Data","SW","Industrial","NW","Open UST & Open LUST",null,null,"MTBE"]
["SA",null,null,null,null,null,"Sediment",null,null,null,"Phys/Mech - Puncture","Dispenser - Under Dispenser Containment",null,null,null,null,null,null,null,null,null,null,null,null,null,null,null,null,null,"Construction (construction activities for months to years)",null,"Pressure Injection into Monitoring Well Using Packer",null,"rSRLs (2007)","residential Soil Remediation Levels (2007)",null,null,null,null,null,null,null,"SP","Stock","NE","Open UST & Closed LUST"]
["RC",null,null,null,null,null,"Food chain",null,null,null,"Phys/Mech - Component Splitting/Separation","Dispenser - Below Impact Valve",null,null,null,null,null,null,null,null,null,null,null,null,null,null,null,null,null,"Non-residential (receptor present an avg 8 hrs a day)",null,"Applied to Base of Excavation (Not Mixed with Soil/Groundwater)",null,"nrSRLs (2007)","non-residential Soil Remediation Levels (2007)",null,null,null,null,null,null,null,"SM","Remediation","SW","Closed UST & Open LUST"]
[null,null,null,null,null,null,null,null,null,null,"Phys/Mech - Loose Fittings","Submersible Turbine Pump (STP)",null,null,null,null,null,null,null,null,null,null,null,null,null,null,null,null,null,"Recreational (examples: parks, hiking areas, etc.)",null,"Applied to Base of Excavation (Mixed with Soil/Groundwater)",null,"GPLs ","Groundwater Protection Levels (site specific or  spreadsheet minimum 2007) ",null,null,null,null,null,null,null,"SC","Dewatering","SE","Closed UST & Closed LUST"]
[null,null,null,null,null,null,null,null,null,null,"Phys/Mech - Component Swelling","STP - Line Leak Detector",null,null,null,null,null,null,null,null,null,null,null,null,null,null,null,null,null,null,null,"Other",null,"Risk based","Tier 2, Tier 3, DEUR, etc.",null,null,null,null,null,null,null,"ML","Other",null,"Open WQARF"]
[null,null,null,null,null,null,null,null,null,null,"Phys/Mech - Component Delamination","STP - Flex Connector",null,null,null,null,null,null,null,null,null,null,null,null,null,null,null,null,null,null,null,null,null,"N/A","Not applicable",null,null,null,null,null,null,null,"CL",null,null,"Closed WQARF"]
[null,null,null,null,null,null,null,null,null,null,"Phys/Mech - Broken Component","STP - STP Sump",null,null,null,null,null,null,null,null,null,null,null,null,null,null,null,null,null,null,null,null,null,"Groundwater",null,null,null,null,null,null,null,null,"OL",null,null,"Other"]
[null,null,null,null,null,null,null,null,null,null,"Phys/Mech - Component Elongation","Delivery Problem - Spill/Overfill at Tank",null,null,null,null,null,null,null,null,null,null,null,null,null,null,null,null,null,null,null,null,null,"HBGLs","Health Based Guidance Levels",null,null,null,null,null,null,null,"MH"]
[null,null,null,null,null,null,null,null,null,null,"Phys/Mech - Component Cracking","Other - Fill Pipe",null,null,null,null,null,null,null,null,null,null,null,null,null,null,null,null,null,null,null,null,null,"AWQS","Aquifer Water Quality Standards",null,null,null,null,null,null,null,"CH"]
[null,null,null,null,null,null,null,null,null,null,"Unknown","Other - Spill Bucket",null,null,null,null,null,null,null,null,null,null,null,null,null,null,null,null,null,null,null,null,null,"Risk based","Tier 2, Tier 3, 263.04, etc.",null,null,null,null,null,null,null,"OH"]
[null,null,null,null,null,null,null,null,null,null,null,"Other - Vent Line",null,null,null,null,null,null,null,null,null,null,null,null,null,null,null,null,null,null,null,null,null,"N/A","Not applicable",null,null,null,null,null,null,null,"PT"]
[null,null,null,null,null,null,null,null,null,null,null,"Other"]
[null,null,null,null,null,null,null,null,null,null,null,"Unknown"]